{"text_format":"1","workbook":"xlsx","n_sheets":4,"sheets":["INGRESO DE DATOS","Bupa Essential Care","Resumen tarifas","Tablas"],"not_rendered":{"charts":0,"images":8,"macros":1,"external_links":0,"defined_names":0,"comments":1,"pivot_tables":0},"unopened":[],"bounds":{"document_bytes":16777216,"sheet_cells":100000,"rows_first":2000,"rows_last":500,"rows_between":2000,"halvings":0,"cell_chars":16384,"cell_head_chars":4096},"cells_cut":0,"cells_raw":0,"read":"whole","date_system":"1900"}

{"sheet":"INGRESO DE DATOS","index":0,"n_rows":43,"n_cols":9,"rows_kept":43,"cut":false,"hidden":false,"merged":[[40,3,40,4],[40,6,40,7],[10,0,10,12],[18,5,18,6],[14,1,14,2],[16,1,16,2],[14,3,14,7],[16,5,16,6],[18,1,18,2]]}
[]
[null,null,null,null,null,null,null," "," "]
[]
[]
[]
[null,null,null,null,null,null,null," "," "]
[]
[]
[]
[]
[]
[]
["1. LLENE LA INFORMACIÓN DEL ASEGURADO PROPUESTO:"]
[]
[null,"Nombre del Asegurado Titular",null,"NOMBRE DEL CLIENTE"]
[]
[null,"Número de adultos en la póliza",null,2,null,"Número de niños en la póliza",null,2]
[]
[null,"Edad del Asegurado Titular",null,32,null,"Edad del/la cónyuge ",null,46]
[]
[]
["2. SELECCIONE EL PRODUCTO PARA VER LA COTIZACIÓN CORRESPONDIENTE: "]
[]
[]
[]
[]
[]
[]
[]
[]
[]
[]
[]
[]
[]
[]
[]
[]
[]
[]
[]
[]
[null,1,null,1]

{"sheet":"Bupa Essential Care","index":1,"n_rows":78,"n_cols":12,"rows_kept":78,"cut":false,"hidden":false,"merged":[[41,0,42,0],[41,1,42,1],[31,4,31,11],[34,4,34,5],[17,0,17,9],[19,0,19,1],[19,3,19,4],[19,5,19,8],[21,3,21,4],[23,3,23,4],[25,3,26,4],[27,4,27,5],[28,4,28,5],[29,4,29,5],[32,4,32,5],[33,4,33,5],[75,4,75,5],[77,4,77,11],[65,4,65,11],[66,4,66,5],[67,4,67,5],[68,4,68,5],[71,4,71,5],[72,4,72,5],[73,4,73,5],[74,4,74,5],[58,4,58,5],[69,4,69,5],[70,4,70,5],[46,4,46,5],[44,4,44,5],[45,4,45,5],[59,4,59,5],[60,4,60,5],[61,4,61,5],[62,4,62,5],[63,4,63,5],[54,4,54,5],[55,4,55,5],[56,4,56,5],[50,4,50,5],[51,4,51,5],[35,4,35,5],[36,4,36,5],[37,4,37,5],[57,4,57,5],[47,4,47,5],[48,4,48,5],[49,4,49,5],[38,4,38,5],[53,4,53,11],[41,4,41,11],[39,4,39,5],[42,4,42,5],[43,4,43,5]]}
[]
[]
[null,null,null,null,null,null,null," "," "," "]
[]
[]
[]
[null,null,null,null,null,null,null," "," "," "]
[]
[]
[]
[]
[]
[]
[]
[]
[]
[]
[]
[]
["Bupa Essential Care",null,null,"Nombre del Asegurado Titular",null,{"$f":"+'INGRESO DE DATOS'!$D$15","v":"NOMBRE DEL CLIENTE"}]
[]
[null,null,null,"Número de adultos en la póliza",null,{"$f":"+'INGRESO DE DATOS'!$D$17","v":2},null,"Edad del Asegurado Titular",{"$f":"+'INGRESO DE DATOS'!$D$19","v":32}]
[]
[null,null,null,"Número de niños en la póliza",null,{"$f":"+'INGRESO DE DATOS'!$H$17","v":2},null,"Edad del/la conyuge",{"$f":"+'INGRESO DE DATOS'!$H$19","v":46}]
[null,null,null,null,null,null,null," "," "]
[null,null,null,null,null,null,"Fecha de la cotización :",{"$f":"NOW()","v":"2021-05-25T14:54:15.840"}]
[null,null,null,null,null,null," ",false,null," "]
[null,null,null,null,"DEDUCIBLES",null,"PLAN 1","PLAN 2","PLAN 3","PLAN 4","PLAN 5","PLAN 6"]
[null,null,null,null,"En el país de residencia",null,500,1000,1000,1000,10000,20000]
[null,null,null,null,"Fuera del país de residencia",null,2000,5000,10000,20000,10000,20000]
[]
[null,null,null,null,"Tarifas anuales"]
[null,null,null,null,"Prima para Asegurado Titular",null,{"$f":"VLOOKUP($I$22,Tablas!$A$905:$G$971,3,TRUE)","v":2049},{"$f":"VLOOKUP($I$22,Tablas!$A$905:$G$971,4,TRUE)","v":1845},{"$f":"VLOOKUP($I$22,Tablas!$A$905:$G$971,5,TRUE)","v":1678},{"$f":"VLOOKUP($I$22,Tablas!$A$905:$G$971,6,TRUE)","v":1501},{"$f":"VLOOKUP($I$22,Tablas!$A$905:$G$971,7,TRUE)","v":1398},{"$f":"VLOOKUP($I$22,Tablas!$A$905:$H$971,8,TRUE)","v":1104}]
[null,null,null,null,"Prima para conyuge",null,{"$f":"IF($F$22=1,0,(VLOOKUP($I$24,Tablas!$A$905:$G$971,3,TRUE)))","v":2907},{"$f":"IF($F$22=1,0,(VLOOKUP($I$24,Tablas!$A$905:$G$971,4,TRUE)))","v":2619},{"$f":"IF($F$22=1,0,(VLOOKUP($I$24,Tablas!$A$905:$G$971,5,TRUE)))","v":2381},{"$f":"IF($F$22=1,0,(VLOOKUP($I$24,Tablas!$A$905:$G$971,6,TRUE)))","v":2130},{"$f":"IF($F$22=1,0,(VLOOKUP($I$24,Tablas!$A$905:$G$971,7,TRUE)))","v":1984},{"$f":"IF($F$22=1,0,(VLOOKUP($I$24,Tablas!$A$905:$H$971,8,TRUE)))","v":1566}]
[null,null,null,null,"Prima para hijo (s)",null,{"$f":"IF($F$24=0,0,(VLOOKUP($F$24,Tablas!$A$972:$G$974,3,TRUE)))","v":1160},{"$f":"IF($F$24=0,0,(VLOOKUP($F$24,Tablas!$A$972:$G$974,4,TRUE)))","v":1045},{"$f":"IF($F$24=0,0,(VLOOKUP($F$24,Tablas!$A$972:$G$974,5,TRUE)))","v":950},{"$f":"IF($F$24=0,0,(VLOOKUP($F$24,Tablas!$A$972:$G$974,6,TRUE)))","v":850},{"$f":"IF($F$24=0,0,(VLOOKUP($F$24,Tablas!$A$972:$G$974,7,TRUE)))","v":792},{"$f":"IF($F$24=0,0,(VLOOKUP($F$24,Tablas!$A$972:$H$974,8,TRUE)))","v":625}]
[null,null,null,null,"Total de Prima neta",null,{"$f":"SUM(G33:G35)","v":6116},{"$f":"SUM(H33:H35)","v":5509},5009,{"$f":"SUM(J33:J35)","v":4481},4174,3295]
[null,null,null,null,"Tarifa administrativa anual",null,75,75,75,75,75,75]
[null,null,null,null,"VAT (5%) :",null,{"$f":"+G36*5%","v":305.8},{"$f":"+H36*5%","v":275.45},250.45000000000002,{"$f":"+J36*5%","v":224.05},208.70000000000002,164.75]
[null,null,null,null,"ITBMS (7%)",null,{"$f":"+G37*7%","v":5.2500000000000009},{"$f":"+H37*7%","v":5.2500000000000009},5.2500000000000009,{"$f":"+J37*7%","v":5.2500000000000009},5.2500000000000009,5.2500000000000009]
[null,null,null,null,"TOTAL ANUAL",null,{"$f":"SUM(G36:G39)","v":6502.05},{"$f":"SUM(H36:H39)","v":5864.7},5339.7,{"$f":"SUM(J36:J39)","v":4785.3},4462.95,3540]
[]
[null,null,null,null,"Tarifas Semianuales"]
[null,null,null,null,"Prima para Asegurado Titular",null,{"$f":"VLOOKUP($I$22,Tablas!$A$1428:$G$1494,3,TRUE)","v":1085.97},{"$f":"VLOOKUP($I$22,Tablas!$A$1428:$G$1494,4,TRUE)","v":977.85},{"$f":"VLOOKUP($I$22,Tablas!$A$1428:$G$1494,5,TRUE)","v":889.34},{"$f":"VLOOKUP($I$22,Tablas!$A$1428:$G$1494,6,TRUE)","v":795.53000000000009},{"$f":"VLOOKUP($I$22,Tablas!$A$1428:$G$1494,7,TRUE)","v":740.94},{"$f":"VLOOKUP($I$22,Tablas!$A$1428:$H$1494,8,TRUE)","v":585.12}]
[null,null,null,null,"Prima para conyuge",null,{"$f":"IF($F$22=1,0,(VLOOKUP($I$24,Tablas!$A$1428:$G$1494,3,TRUE)))","v":1540.71},{"$f":"IF($F$22=1,0,(VLOOKUP($I$24,Tablas!$A$1428:$G$1494,4,TRUE)))","v":1388.0700000000002},{"$f":"IF($F$22=1,0,(VLOOKUP($I$24,Tablas!$A$1428:$G$1494,5,TRUE)))","v":1261.93},{"$f":"IF($F$22=1,0,(VLOOKUP($I$24,Tablas!$A$1428:$G$1494,6,TRUE)))","v":1128.9000000000001},{"$f":"IF($F$22=1,0,(VLOOKUP($I$24,Tablas!$A$1428:$G$1494,7,TRUE)))","v":1051.52},{"$f":"IF($F$22=1,0,(VLOOKUP($I$24,Tablas!$A$1428:$H$1494,8,TRUE)))","v":829.98}]
[null,null,null,null,"Prima para hijo (s)",null,{"$f":"IF($F$24=0,0,(VLOOKUP($F$24,Tablas!$A$1495:$G$1497,3,TRUE)))","v":614.80000000000007},{"$f":"IF($F$24=0,0,(VLOOKUP($F$24,Tablas!$A$1495:$G$1497,4,TRUE)))","v":553.85},{"$f":"IF($F$24=0,0,(VLOOKUP($F$24,Tablas!$A$1495:$G$1497,5,TRUE)))","v":503.5},{"$f":"IF($F$24=0,0,(VLOOKUP($F$24,Tablas!$A$1495:$G$1497,6,TRUE)))","v":450.5},{"$f":"IF($F$24=0,0,(VLOOKUP($F$24,Tablas!$A$1495:$G$1497,7,TRUE)))","v":419.76000000000005},{"$f":"IF($F$24=0,0,(VLOOKUP($F$24,Tablas!$A$1495:$H$1497,8,TRUE)))","v":331.25}]
[null,null,null,null,"Total de Prima neta",null,{"$f":"SUM(G43:G45)","v":3241.4800000000005},{"$f":"SUM(H43:H45)","v":2919.77},{"$f":"SUM(I43:I45)","v":2654.77},{"$f":"SUM(J43:J45)","v":2374.9300000000003},2212.2200000000003,1746.35]
[null,null,null,null,"Tarifa administrativa anual",null,75,75,75,75,75,75]
[null,null,null,null,"VAT (5%) :",null,{"$f":"(G33+G34+G35)*5%/2","v":152.9},137.72499999999999,125.22500000000001,112.02500000000001,104.35000000000001,82.375]
[null,null,null,null,"ITBMS (7%)",null,{"$f":"+G47*7% + ((G33+G34+G35)*0.06*0.07)/2","v":18.093600000000002},16.818899999999999,15.768900000000002,14.660100000000003,14.015400000000003,12.169500000000001]
[null,null,null,null,"TOTAL de primera cuota",null,{"$f":"SUM(G46:G49)","v":3487.4736000000007},{"$f":"SUM(H46:H49)","v":3149.3139000000001},2870.7638999999999,{"$f":"SUM(J46:J49)","v":2576.6151000000004},2405.5854000000004,1915.8944999999999]
[null,null,null,null,"Costo de segunda cuota",null,{"$f":"(G46 + G48)+((G33+G34+G35)*0.06*0.07)/2","v":3407.2236000000007},{"$f":"(H46 + H48)+((H33+H34+H35)*0.06*0.07)/2","v":3069.0639000000001},2790.5138999999999,2496.3651000000004,2325.3354000000004,1835.6444999999999]
[null,null,null,null,"TOTAL ANUAL",null,{"$f":"G50+G51","v":6894.6972000000014},{"$f":"H50+H51","v":6218.3778000000002},5661.2777999999998,{"$f":"J50+J51","v":5072.9802000000009},4730.9208000000008,3751.5389999999998]
[]
[null,null,null,null,"Tarifas Trimestrales"]
[null,null,null,null,"Prima para Asegurado Titular",null,{"$f":"VLOOKUP($I$22,Tablas!$A$1054:$G$1120,3,TRUE)","v":563.47500000000002},{"$f":"VLOOKUP($I$22,Tablas!$A$1054:$G$1120,4,TRUE)","v":507.37500000000006},{"$f":"VLOOKUP($I$22,Tablas!$A$1054:$G$1120,5,TRUE)","v":461.45000000000005},{"$f":"VLOOKUP($I$22,Tablas!$A$1054:$G$1120,6,TRUE)","v":412.77500000000003},{"$f":"VLOOKUP($I$22,Tablas!$A$1054:$G$1120,7,TRUE)","v":384.45000000000005},{"$f":"VLOOKUP($I$22,Tablas!$A$1054:$H$1120,8,TRUE)","v":303.60000000000002}]
[null,null,null,null,"Prima para conyuge",null,{"$f":"IF($F$22=1,0,(VLOOKUP($I$24,Tablas!$A$1054:$G$1120,3,TRUE)))","v":799.42500000000007},{"$f":"IF($F$22=1,0,(VLOOKUP($I$24,Tablas!$A$1054:$G$1120,4,TRUE)))","v":720.22500000000002},{"$f":"IF($F$22=1,0,(VLOOKUP($I$24,Tablas!$A$1054:$G$1120,5,TRUE)))","v":654.77500000000009},{"$f":"IF($F$22=1,0,(VLOOKUP($I$24,Tablas!$A$1054:$G$1120,6,TRUE)))","v":585.75},{"$f":"IF($F$22=1,0,(VLOOKUP($I$24,Tablas!$A$1054:$G$1120,7,TRUE)))","v":545.6},{"$f":"IF($F$22=1,0,(VLOOKUP($I$24,Tablas!$A$1054:$H$1120,8,TRUE)))","v":430.65000000000003}]
[null,null,null,null,"Prima para hijo (s)",null,{"$f":"IF($F$24=0,0,(VLOOKUP($F$24,Tablas!$A$1121:$G$1123,3,TRUE)))","v":319},{"$f":"IF($F$24=0,0,(VLOOKUP($F$24,Tablas!$A$1121:$G$1123,4,TRUE)))","v":287.375},{"$f":"IF($F$24=0,0,(VLOOKUP($F$24,Tablas!$A$1121:$G$1123,5,TRUE)))","v":261.25},{"$f":"IF($F$24=0,0,(VLOOKUP($F$24,Tablas!$A$1121:$G$1123,6,TRUE)))","v":233.75000000000003},{"$f":"IF($F$24=0,0,(VLOOKUP($F$24,Tablas!$A$1121:$G$1123,7,TRUE)))","v":217.8},{"$f":"IF($F$24=0,0,(VLOOKUP($F$24,Tablas!$A$1121:$H$1123,8,TRUE)))","v":171.875}]
[null,null,null,null,"Total de Prima neta",null,{"$f":"SUM(G55:G57)","v":1681.9},{"$f":"SUM(H55:H57)","v":1514.9750000000001},{"$f":"SUM(I55:I57)","v":1377.4750000000001},{"$f":"SUM(J55:J57)","v":1232.2750000000001},1147.8500000000001,906.125]
[null,null,null,null,"Tarifa administrativa anual",null,75,75,75,75,75,75]
[null,null,null,null,"VAT (5%) :",null,{"$f":"(G33+G34+G35)*5%/4","v":76.45},68.862499999999997,62.612500000000004,56.012500000000003,52.175000000000004,41.1875]
[null,null,null,null,"ITBMS (7%)",null,{"$f":"+G59*7% + ((G33+G34+G35)*0.1*0.07)/4","v":15.953000000000003},14.890750000000001,14.015750000000001,13.091750000000001,12.554500000000001,11.016250000000001]
[null,null,null,null,"TOTAL de primera cuota",null,{"$f":"SUM(G58:G61)","v":1849.3030000000001},{"$f":"SUM(H58:H61)","v":1673.7282500000001},1529.1032500000001,{"$f":"SUM(J58:J61)","v":1376.3792500000002},1287.5795000000001,1033.3287499999999]
[null,null,null,null,"Costo de tarifa trimestral 2 a 4",null,{"$f":"(G58 + G60)+((G33+G34+G35)*0.1*0.07)/4","v":1769.0530000000001},1593.4782500000001,1448.8532500000001,1296.1292500000002,1207.3295000000001,953.07875000000001]
[null,null,null,null,"TOTAL ANUAL",null,{"$f":"G62+(G63*3)","v":7156.4620000000004},{"$f":"H62+(H63*3)","v":6454.1630000000005},5875.6630000000005,{"$f":"J62+(J63*3)","v":5264.7670000000007},4909.5680000000002,3892.5649999999996]
[]
[null,null,null,null,"Tarifas Mensuales"]
[null,null,null,null,"Prima para Asegurado Titular",null,{"$f":"VLOOKUP($I$22,Tablas!$A$979:$G$1045,3,TRUE)","v":191.24},{"$f":"VLOOKUP($I$22,Tablas!$A$979:$G$1045,4,TRUE)","v":172.20000000000002},{"$f":"VLOOKUP($I$22,Tablas!$A$979:$G$1045,5,TRUE)","v":156.61333333333334},{"$f":"VLOOKUP($I$22,Tablas!$A$979:$G$1045,6,TRUE)","v":140.09333333333333},{"$f":"VLOOKUP($I$22,Tablas!$A$979:$G$1045,7,TRUE)","v":130.48000000000002},{"$f":"VLOOKUP($I$22,Tablas!$A$979:$H$1045,8,TRUE)","v":103.04}]
[null,null,null,null,"Prima para conyuge",null,{"$f":"IF($F$22=1,0,(VLOOKUP($I$24,Tablas!$A$979:$G$1045,3,TRUE)))","v":271.32},{"$f":"IF($F$22=1,0,(VLOOKUP($I$24,Tablas!$A$979:$G$1045,4,TRUE)))","v":244.44},{"$f":"IF($F$22=1,0,(VLOOKUP($I$24,Tablas!$A$979:$G$1045,5,TRUE)))","v":222.22666666666669},{"$f":"IF($F$22=1,0,(VLOOKUP($I$24,Tablas!$A$979:$G$1045,6,TRUE)))","v":198.8},{"$f":"IF($F$22=1,0,(VLOOKUP($I$24,Tablas!$A$979:$G$1045,7,TRUE)))","v":185.17333333333335},{"$f":"IF($F$22=1,0,(VLOOKUP($I$24,Tablas!$A$979:$H$1045,8,TRUE)))","v":146.16}]
[null,null,null,null,"Prima para hijo (s)",null,{"$f":"IF($F$24=0,0,(VLOOKUP($F$24,Tablas!$A$1046:$G$1048,3,TRUE)))","v":108.26666666666667},{"$f":"IF($F$24=0,0,(VLOOKUP($F$24,Tablas!$A$1046:$G$1048,4,TRUE)))","v":97.533333333333331},{"$f":"IF($F$24=0,0,(VLOOKUP($F$24,Tablas!$A$1046:$G$1048,5,TRUE)))","v":88.666666666666671},{"$f":"IF($F$24=0,0,(VLOOKUP($F$24,Tablas!$A$1046:$G$1048,6,TRUE)))","v":79.333333333333343},{"$f":"IF($F$24=0,0,(VLOOKUP($F$24,Tablas!$A$1046:$G$1048,7,TRUE)))","v":73.92},{"$f":"IF($F$24=0,0,(VLOOKUP($F$24,Tablas!$A$1046:$H$1048,8,TRUE)))","v":58.333333333333336}]
[null,null,null,null,"Total de Prima neta",null,{"$f":"SUM(G67:G69)","v":570.82666666666671},{"$f":"SUM(H67:H69)","v":514.17333333333329},{"$f":"SUM(I67:I69)","v":467.50666666666672},{"$f":"SUM(J67:J69)","v":418.22666666666669},389.57333333333338,307.5333333333333]
[null,null,null,null,"Tarifa administrativa anual",null,75,75,75,75,75,75]
[null,null,null,null,"VAT (5%) :",null,{"$f":"(G33+G34+G35)*5%/12","v":25.483333333333334},22.954166666666666,20.870833333333334,18.670833333333334,17.391666666666669,13.729166666666666]
[null,null,null,null,"ITBMS (7%)",null,{"$f":"+G71*7% + ((G33+G34+G35)*0.12*0.07)/12","v":9.5312000000000019},9.1063000000000009,8.7563000000000013,8.3867000000000012,8.1718000000000011,7.5565000000000015]
[null,null,null,null,"TOTAL de primera cuota",null,{"$f":"SUM(G70:G73)","v":680.84120000000007},{"$f":"SUM(H70:H73)","v":621.23379999999997},572.13379999999995,{"$f":"SUM(J70:J73)","v":520.28420000000006},490.13680000000005,403.81900000000002]
[null,null,null,null,"Costo de Tarifa mensual de 2 a 12",null,{"$f":"(G70 + G72)+((G33+G34+G35)*0.12*0.07)/12","v":600.59120000000007},540.98379999999997,491.88380000000006,440.03420000000006,409.88680000000005,323.56900000000002]
[null,null,null,null,"TOTAL ANUAL",null,{"$f":"G74+(G75*11)","v":7287.3444000000009},{"$f":"H74+(H75*11)","v":6572.0555999999997},5982.8556000000008,{"$f":"J74+(J75*11)","v":5360.6604000000007},4998.8916000000008,3963.078]
[]
[null,null,null,null,"Tarifas en US$ -  Efectivas a partir del 15 de agosto, 2020"]

{"sheet":"Resumen tarifas","index":2,"n_rows":47,"n_cols":8,"rows_kept":47,"cut":false,"hidden":false,"merged":[[16,0,16,6],[18,2,18,6],[21,4,21,5],[24,4,24,5],[29,0,29,1],[27,4,27,6],[18,0,18,1],[21,0,21,1],[24,0,24,1],[30,0,30,1],[33,0,33,1],[34,0,34,1],[35,0,35,1],[36,0,36,1],[31,0,31,1],[32,0,32,1],[39,2,39,7],[37,2,37,7],[35,2,35,7],[33,2,33,7],[46,0,46,7],[44,0,44,1],[40,0,40,1],[38,0,38,1],[39,0,39,1],[37,0,37,1]]}
[]
[null,null,null,null," "," "]
[]
[]
[]
[null,null,null,null," "," "," "]
[]
[]
[]
[]
[]
[]
[]
[]
[]
[]
["Cotizador de Seguro Médico - Bupa Global Health Plans"]
[]
["Nombre del Asegurado Titular",null,{"$f":"+'INGRESO DE DATOS'!$D$15","v":"NOMBRE DEL CLIENTE"}]
[]
[]
["Número de adultos en la póliza",null,{"$f":"+'INGRESO DE DATOS'!$D$17","v":2},null,"Edad del Asegurado Titular",null,{"$f":"+'INGRESO DE DATOS'!$D$19","v":32}]
[]
[]
["Número de niños en la póliza",null,{"$f":"+'INGRESO DE DATOS'!$H$17","v":2},null,"Edad del/la cónyuge ",null,{"$f":"+'INGRESO DE DATOS'!$H$19","v":46}]
[]
[]
[null,null,null,"FECHA DE LA COTIZACIÓN ",{"$f":"NOW()","v":"2021-05-25T14:54:15.840"}]
[]
["Bupa Essential Care"]
["DEDUCIBLES",null,"PLAN 1","PLAN 2","PLAN 3","PLAN 4","PLAN 5","PLAN 6"]
["En el país de residencia",null,500,1000,1000,1000,10000,20000]
["Fuera del país de residencia",null,2000,5000,10000,20000,10000,20000]
[null,null,"Tarifas Anuales"]
[null,null,{"$f":"'Bupa Essential Care'!G40","v":6502.05},{"$f":"'Bupa Essential Care'!H40","v":5864.7},{"$f":"'Bupa Essential Care'!I40","v":5339.7},{"$f":"'Bupa Essential Care'!J40","v":4785.3},{"$f":"'Bupa Essential Care'!K40","v":4462.95},{"$f":"'Bupa Essential Care'!L40","v":3540}]
[null,null,"Tarifas Semianuales"]
[null,null,{"$f":"'Bupa Essential Care'!G52","v":6894.6972000000014},{"$f":"'Bupa Essential Care'!H52","v":6218.3778000000002},{"$f":"'Bupa Essential Care'!I52","v":5661.2777999999998},{"$f":"'Bupa Essential Care'!J52","v":5072.9802000000009},{"$f":"'Bupa Essential Care'!K52","v":4730.9208000000008},{"$f":"'Bupa Essential Care'!L52","v":3751.5389999999998}]
[null,null,"Tarifas Trimestrales"]
[null,null,{"$f":"'Bupa Essential Care'!G64","v":7156.4620000000004},{"$f":"'Bupa Essential Care'!H64","v":6454.1630000000005},{"$f":"'Bupa Essential Care'!I64","v":5875.6630000000005},{"$f":"'Bupa Essential Care'!J64","v":5264.7670000000007},{"$f":"'Bupa Essential Care'!K64","v":4909.5680000000002},{"$f":"'Bupa Essential Care'!L64","v":3892.5649999999996}]
[null,null,"Tarifas Mensuales"]
[null,null,{"$f":"'Bupa Essential Care'!G76","v":7287.3444000000009},{"$f":"'Bupa Essential Care'!H76","v":6572.0555999999997},{"$f":"'Bupa Essential Care'!I76","v":5982.8556000000008},{"$f":"'Bupa Essential Care'!J76","v":5360.6604000000007},{"$f":"'Bupa Essential Care'!K76","v":4998.8916000000008},{"$f":"'Bupa Essential Care'!L76","v":3963.078}]
[]
[]
["Una tarifa administrativa de US$75 se cargará automáticamente al primer pago"]
["*Basado en un modo de pago anual"]
[]
["Tarifas en US$ -  Efectivas a partir del 15 de agosto, 2020"]

{"sheet":"Tablas","index":3,"n_rows":1497,"n_cols":14,"rows_kept":1497,"cut":false,"hidden":true,"merged":[[1424,0,1424,6],[1425,0,1425,1],[1425,2,1425,6],[1348,0,1348,6],[1349,0,1349,6],[1350,0,1350,1],[1350,2,1350,6],[1423,0,1423,6],[1200,0,1200,1],[1200,2,1200,6],[1273,0,1273,6],[1274,0,1274,6],[1275,0,1275,1],[1275,2,1275,6],[1124,0,1124,6],[1125,0,1125,6],[1126,0,1126,1],[1126,2,1126,6],[1199,0,1199,6],[976,0,976,1],[976,2,976,6],[1049,0,1049,6],[1050,0,1050,6],[1051,0,1051,1],[1051,2,1051,6],[900,0,900,6],[901,0,901,6],[902,0,902,1],[902,2,902,6],[975,0,975,6],[1,0,1,6],[2,0,2,6],[77,0,77,1],[77,2,77,6],[76,0,76,6],[3,0,3,1],[3,2,3,6],[525,0,525,6],[376,0,376,1],[376,2,376,6],[150,0,150,6],[151,0,151,6],[152,0,152,1],[152,2,152,6],[225,0,225,6],[226,0,226,1],[375,0,375,6],[226,2,226,6],[300,0,300,6],[301,0,301,6],[302,0,302,1],[302,2,302,6],[827,0,827,1],[827,2,827,6],[751,0,751,6],[675,0,675,6],[676,0,676,6],[677,0,677,1],[677,2,677,6],[750,0,750,6],[63,7,65,7],[752,0,752,1],[752,2,752,6],[825,0,825,6],[826,0,826,6],[527,0,527,1],[527,2,527,6],[600,0,600,6],[601,0,601,6],[602,0,602,1],[602,2,602,6],[526,0,526,6],[450,0,450,6],[451,0,451,6],[452,0,452,1],[452,2,452,6]]}
[]
["BUPA GLOBAL ELITE",null,null,null,null,null,null,null,"FACTOR MENSUAL:",null,8.3333333333333329E-2,null,null,9.3333333333333338E-2]
["TARIFAS ANUALES",null,null,null,null,null,null,null,"FACTOR TRIMESTRAL:",null,0.25,null,null,0.27500000000000002]
["EDAD",null,null,null,null,null,null,null,"FACTOR SEMIANUAL:",null,0.5,null,null,0.53]
[" "," ",1000,2000,3500,5000,10000]
[18,null,7418,5313,4499,3901,3026]
[19,null,7516,5377,4546,3943,3058]
[20,null,7616,5445,4597,3986,3091]
[21,null,7719,5514,4649,4031,3126]
[22,null,7826,5586,4702,4077,3161]
[23,null,7939,5658,4759,4127,3201]
[24,null,8051,5735,4816,4176,3239]
[25,null,8168,5815,4875,4228,3279]
[26,null,8336,5929,4962,4304,3337]
[27,null,8511,6048,5054,4381,3399]
[28,null,8691,6170,5148,4464,3461]
[29,null,8880,6298,5247,4550,3529]
[30,null,9074,6433,5351,4640,3599]
[31,null,9275,6570,5459,4733,3672]
[32,null,9481,6713,5568,4828,3743]
[33,null,9694,6860,5684,4928,3823]
[34,null,9914,7012,5802,5031,3901]
[35,null,10138,7168,5926,5139,3986]
[36,null,10370,7329,6052,5247,4070]
[37,null,10609,7497,6182,5362,4158]
[38,null,10853,7666,6317,5479,4249]
[39,null,11105,7843,6456,5598,4341]
[40,null,11362,8023,6598,5721,4438]
[41,null,11626,8208,6745,5849,4537]
[42,null,11895,8397,6896,5979,4638]
[43,null,12170,8593,7051,6114,4742]
[44,null,12453,8790,7208,6251,4849]
[45,null,12742,8995,7372,6391,4957]
[46,null,13037,9203,7539,6538,5069]
[47,null,13338,9418,7708,6683,5184]
[48,null,13646,9634,7882,6834,5300]
[49,null,13961,9858,8061,6990,5420]
[50,null,14280,10084,8244,7149,5544]
[51,null,14607,10316,8432,7311,5669]
[52,null,14939,10553,8619,7473,5797]
[53,null,15279,10797,8815,7643,5928]
[54,null,15625,11043,9012,7814,6061]
[55,null,15977,11293,9215,7990,6197]
[56,null,16333,11548,9421,8169,6336]
[57,null,16699,11808,9631,8350,6476]
[58,null,17070,12073,9845,8536,6620]
[59,null,17446,12343,10062,8725,6766]
[60,null,17829,12618,10285,8917,6916]
[61,null,19842,14061,11454,9932,7704]
[62,null,22011,15624,12724,11033,8556]
[63,null,24339,17302,14091,12218,9476]
[64,null,26824,19100,15557,13490,10463]
[65,null,29466,21015,17123,14847,11515]
[66,null,32267,23047,18789,16293,12636]
[67,null,35226,25197,20553,17822,13822]
[68,null,38343,27466,22415,19436,15074]
[69,null,41616,29852,24379,21139,16394]
[70,null,45049,32357,26441,22927,17782]
[71,null,48640,34979,28602,24801,19235]
[72,null,52387,37721,30862,26760,20754]
[73,null,56292,40578,33220,28805,22340]
[74,null,60356,43554,35679,30938,23994]
[75,null,64577,46649,38237,33155,25713]
[76,null,64577,46649,38237,33155,25713]
[77,null,64577,46649,38237,33155,25713]
[78,null,64577,46649,38237,33155,25713]
[79,null,64577,46649,38237,33155,25713]
[80,null,64577,46649,38237,33155,25713]
[81,null,64577,46649,38237,33155,25713]
[82,null,64577,46649,38237,33155,25713]
[83,null,64577,46649,38237,33155,25713]
[84,"o más",64577,46649,38237,33155,25713]
[1,"Hijo",3339,2391,2025,1756,1363]
[2,"Hijos",5675,4065,3442,2984,2316]
[3,"Hijos o más",8011,5738,4860,4213,3268]
[]
["BUPA GLOBAL ELITE - MENSUALES"]
["EDAD"]
[" "," ",1000,2000,3500]
[18,null,{"$f":"C6*$K$2","v":618.16666666666663},{"$f":"D6*$K$2","v":442.75},374.91666666666663,325.08333333333331,252.16666666666666]
{"$rows_left_out":1417}