{"text_format":"1","workbook":"xlsx","n_sheets":8,"sheets":["INGRESO DE DATOS","Global Ultimate Health  Plan","Global Elite Health  Plan","Global Premier Health  Plan","Global Select Health Plan","Global Major Medical Health  Pl","Resumen tarifas","Tablas"],"not_rendered":{"charts":0,"images":8,"macros":1,"external_links":0,"defined_names":6,"comments":1,"pivot_tables":0},"unopened":[],"bounds":{"document_bytes":16777216,"sheet_cells":100000,"rows_first":2000,"rows_last":500,"rows_between":2000,"halvings":0,"cell_chars":16384,"cell_head_chars":4096},"cells_cut":0,"cells_raw":0,"read":"whole","date_system":"1900"}

{"sheet":"INGRESO DE DATOS","index":0,"n_rows":33,"n_cols":9,"rows_kept":33,"cut":false,"hidden":false,"merged":[[28,3,28,4],[28,6,28,7],[9,0,9,12],[18,5,18,6],[14,1,14,2],[16,1,16,2],[14,3,14,7],[16,5,16,6],[18,1,18,2],[20,3,20,7]]}
[]
[null,null,null,null,null,null,null," "," "]
[]
[]
[]
[null,null,null,null,null,null,null," "," "]
[]
[]
[]
[]
[]
[]
["LLENE LA INFORMACIÓN DEL ASEGURADO PROPUESTO:"]
[]
[null,"Nombre del Asegurado Titular:",null,"JOHN DOE"]
[]
[null,"Número de adultos en la póliza:",null,2,null,"Número de niños en la póliza:",null,3]
[]
[null,"Edad del Asegurado Titular:",null,65,null,"Edad del/la cónyuge:",null,71]
[]
[null,null,"Cotizador por:","NOMBRE DE AGENTE"]
[]
[]
[]
["SELECCIONE EL PRODUCTO PARA VER LA COTIZACIÓN CORRESPONDIENTE: "]
[]
[]
[]
[]
[]
{"$rows_left_out":4}
{"sheet":"Global Ultimate Health  Plan","index":1,"n_rows":81,"n_cols":11,"rows_kept":81,"cut":false,"hidden":false,"merged":[[104,0,104,1],[73,0,74,1],[90,0,90,1],[21,3,21,4],[42,0,42,1],[58,0,58,1],[62,0,62,1],[78,0,78,1],[80,4,82,7],[79,4,79,7],[61,4,61,5],[36,4,36,5],[55,4,55,5],[69,4,69,5],[70,4,70,5],[76,4,76,5],[38,4,38,7],[50,4,50,7],[65,4,65,7],[43,0,44,0],[43,1,44,1],[48,4,48,5],[54,4,54,5],[13,3,13,4],[13,5,13,8],[17,3,17,4],[19,3,19,4],[37,0,37,1],[27,4,27,7],[15,3,15,4],[15,5,15,8],[22,0,22,1],[13,0,13,1]]}
[]
[]
[null,null,null,null,null,null,null," "," "," "]
[]
[]
[]
[null,null,null,null,null,null,null," "," "," "]
[]
[]
[]
[]
[]
[]
["Global Ultimate Health Plan",null,null,"Nombre del Asegurado Titular:",null,{"$f":"+'INGRESO DE DATOS'!$D$15","v":"JOHN DOE"}]
[]
[null,null,null,"Cotizado por:",null,{"$f":"+'INGRESO DE DATOS'!$D$21","v":"NOMBRE DE AGENTE"}]
[]
[null,null,null,"Número de adultos en la póliza:",null,{"$f":"+'INGRESO DE DATOS'!$D$17","v":2},null,"Edad del Asegurado Titular:",{"$f":"+'INGRESO DE DATOS'!$D$19","v":65}]
[]
[null,null,null,"Número de niños en la póliza:",null,3,null,"Edad del/la conyuge:",{"$f":"+'INGRESO DE DATOS'!$H$19","v":71}]
[null,null,null,null,null,null,null," "," "]
[null,null,null,"Número de niños menores de 16 años:",null,{"$f":"+'INGRESO DE DATOS'!$B$33","v":2},null,"Fecha de la cotización:",{"$f":"NOW()","v":"2022-12-06T15:03:42.210"}]
[null,null,null,null,null,null," ",false,null," ","s"]
[null,null,null,null,"Deducibles",null,"PLAN 1","PLAN 2"]
[null,null,null,null,"En el país de residencia",null,0,1000]
[null,null,null,null,"Fuera del país de residencia",null,0,1000]
[]
[null,null,null,null,"Tarifas Anuales"]
[null,null,null,null,"Prima para Asegurado Titular",null,{"$f":"(VLOOKUP($I$18,Tablas!$A$905:$G$971,3,TRUE))*1.1494","v":106520.645},{"$f":"(VLOOKUP($I$18,Tablas!$A$905:$G$971,4,TRUE))*1.1494","v":68726.074200000003}]
[null,null,null,null,"Prima para conyuge",null,{"$f":"(IF($F$18=1,0,(VLOOKUP($I$20,Tablas!$A$905:$G$971,3,TRUE))))*1.1494","v":175778.89139999999},{"$f":"(IF($F$18=1,0,(VLOOKUP($I$20,Tablas!$A$905:$G$971,4,TRUE))))*1.1494","v":113408.99919999999}]
{"$rows_left_out":52}
{"sheet":"Global Elite Health  Plan","index":2,"n_rows":80,"n_cols":11,"rows_kept":80,"cut":false,"hidden":false,"merged":[[79,0,79,1],[89,0,89,1],[42,0,42,1],[59,0,59,1],[79,4,80,10],[78,4,78,10],[38,4,38,10],[50,4,50,10],[21,3,21,4],[19,3,19,4],[13,5,13,8],[13,3,13,4],[17,3,17,4],[13,0,13,1],[15,5,15,8],[69,4,69,5],[68,4,68,5],[75,4,75,5],[64,4,64,10],[22,0,22,1],[37,0,37,1],[63,0,63,1],[75,0,75,1],[27,4,27,10],[36,4,36,5],[48,4,48,5],[61,4,61,5],[54,4,54,5],[55,4,55,5]]}
[]
[]
[null,null,null,null,null,null,null," "," "," "]
[]
[]
[]
[null,null,null,null,null,null,null," "," "," "]
[]
[]
[]
[]
[]
[]
["Bupa Global Elite Health Plan",null,null,"Nombre del Asegurado Titular:",null,{"$f":"+'INGRESO DE DATOS'!$D$15","v":"JOHN DOE"}]
[]
[null,null,null,null,"Cotizado por:",{"$f":"+'INGRESO DE DATOS'!$D$21","v":"NOMBRE DE AGENTE"}]
[]
[null,null,null,"Número de adultos en la póliza:",null,{"$f":"+'INGRESO DE DATOS'!$D$17","v":2},null,"Edad del Asegurado Titular:",{"$f":"+'INGRESO DE DATOS'!$D$19","v":65}]
[]
[null,null,null,"Número de niños en la póliza:",null,{"$f":"+'INGRESO DE DATOS'!$H$17","v":3},null,"Edad del/la conyuge:",{"$f":"+'INGRESO DE DATOS'!$H$19","v":71}]
[null,null,null,null,null,null,null," "," "]
[null,null,null,"Número de niños menores de 10 años:",null,{"$f":"+'INGRESO DE DATOS'!$D$33","v":2},null,"Fecha de la cotización:",{"$f":"NOW()","v":"2022-12-06T15:03:42.210"}]
[null,null,null,null,null,null," ",false,null," "]
[null,null,null,null,"Deducibles",null,"PLAN 1","PLAN 2","PLAN 3","PLAN 4","PLAN 5"]
[null,null,null,null,"En el país de residencia",null,250,2000,3500,5000,10000]
[null,null,null,null,"Fuera del país de residencia",null,5000,2000,3500,5000,10000]
[]
[null,null,null,null,"Tarifas Anuales"]
[null,null,null,null,"Prima para Asegurado Titular",null,{"$f":"(VLOOKUP($I$18,Tablas!$A$6:$G$72,3,TRUE))*1.1494","v":45946.115599999997},{"$f":"(VLOOKUP($I$18,Tablas!$A$6:$G$72,4,TRUE))*1.1494","v":40276.125399999997},{"$f":"(VLOOKUP($I$18,Tablas!$A$6:$G$72,5,TRUE))*1.1494","v":32409.631799999999},{"$f":"(VLOOKUP($I$18,Tablas!$A$6:$G$72,6,TRUE))*1.1494","v":28105.128799999999},{"$f":"(VLOOKUP($I$18,Tablas!$A$6:$G$72,7,TRUE))*1.1494","v":21408.724399999999}]
[null,null,null,null,"Prima para conyuge",null,{"$f":"(IF($F$18=1,0,(VLOOKUP($I$20,Tablas!$A$6:$G$72,3,TRUE))))*1.1494","v":76461.536200000002},{"$f":"(IF($F$18=1,0,(VLOOKUP($I$20,Tablas!$A$6:$G$72,4,TRUE))))*1.1494","v":67020.364600000001},{"$f":"(IF($F$18=1,0,(VLOOKUP($I$20,Tablas!$A$6:$G$72,5,TRUE))))*1.1494","v":54122.947200000002},{"$f":"(IF($F$18=1,0,(VLOOKUP($I$20,Tablas!$A$6:$G$72,6,TRUE))))*1.1494","v":46932.300799999997},{"$f":"(IF($F$18=1,0,(VLOOKUP($I$20,Tablas!$A$6:$G$72,7,TRUE))))*1.1494","v":35746.339999999997}]
{"$rows_left_out":51}
{"sheet":"Global Premier Health  Plan","index":3,"n_rows":74,"n_cols":10,"rows_kept":74,"cut":false,"hidden":false,"merged":[[73,4,74,9],[61,0,61,1],[72,0,72,1],[76,0,76,1],[86,0,86,1],[11,3,11,4],[15,3,15,4],[17,3,17,4],[11,5,11,8],[13,5,13,8],[57,0,57,1],[72,4,72,9],[11,0,11,1],[20,0,20,1],[35,0,35,1],[40,0,40,1],[41,1,42,1],[41,0,42,0],[50,4,50,5],[51,4,51,5],[63,4,63,5],[64,4,64,5],[25,4,25,9],[35,4,35,9],[46,4,46,9],[59,4,59,9]]}
[]
[]
[null,null,null,null,null,null,null," "," "," "]
[]
[]
[]
[null,null,null,null,null,null,null," "," "," "]
[]
[]
[]
[]
["Global Premier Health Plan",null,null,"Nombre del Asegurado Titular:",null,{"$f":"+'INGRESO DE DATOS'!$D$15","v":"JOHN DOE"}]
[]
[null,null,null,null,"Cotizado por:",{"$f":"+'INGRESO DE DATOS'!$D$21","v":"NOMBRE DE AGENTE"}]
[]
[null,null,null,"Número de adultos en la póliza:",null,{"$f":"+'INGRESO DE DATOS'!$D$17","v":2},null,"Edad del Asegurado Titular:",{"$f":"+'INGRESO DE DATOS'!$D$19","v":65}]
[]
[null,null,null,"Número de niños en la póliza:",null,{"$f":"+'INGRESO DE DATOS'!$H$17","v":3},null,"Edad del/la conyuge:",{"$f":"+'INGRESO DE DATOS'!$H$19","v":71}]
[null,null,null,null,null,null,null," "," "]
[null,null,null,null,"Fecha de la cotización:",{"$f":"NOW()","v":"2022-12-06T15:03:42.210"}]
[null,null,null,null,null,null," ",false,null," "]
[null,null,null,null,"Deducibles",null,"PLAN 1","PLAN 2","PLAN 3","PLAN 4"]
[null,null,null,null,"En el país de residencia",null,250,2000,5000,10000]
[null,null,null,null,"Fuera del país de residencia",null,5000,2000,5000,10000]
[]
[null,null,null,null,"Tarifas Anuales"]
[null,null,null,null,"Prima para Asegurado Titular",null,{"$f":"(VLOOKUP($I$16,Tablas!$A$155:$G$221,3,TRUE))*1.1494","v":30198.1862},{"$f":"(VLOOKUP($I$16,Tablas!$A$155:$G$221,4,TRUE))*1.1494","v":27406.293600000001},{"$f":"(VLOOKUP($I$16,Tablas!$A$155:$G$221,5,TRUE))*1.1494","v":19511.064999999999},{"$f":"(VLOOKUP($I$16,Tablas!$A$155:$G$221,6,TRUE))*1.1494","v":14254.8588}]
[null,null,null,null,"Prima para conyuge",null,{"$f":"(IF($F$16=1,0,(VLOOKUP($I$18,Tablas!$A$155:$G$221,3,TRUE))))*1.1494","v":50255.216200000003},{"$f":"(IF($F$16=1,0,(VLOOKUP($I$18,Tablas!$A$155:$G$221,4,TRUE))))*1.1494","v":45605.893199999999},{"$f":"(IF($F$16=1,0,(VLOOKUP($I$18,Tablas!$A$155:$G$221,5,TRUE))))*1.1494","v":32665.948},{"$f":"(IF($F$16=1,0,(VLOOKUP($I$18,Tablas!$A$155:$G$221,6,TRUE))))*1.1494","v":23864.992200000001}]
[null,null,null,null,"Prima para hijo (s)",null,{"$f":"(IF($F$18=0,0,(VLOOKUP($F$18,Tablas!$A$222:$G$224,3,TRUE))))*1.1494","v":7623.9701999999997},{"$f":"(IF($F$18=0,0,(VLOOKUP($F$18,Tablas!$A$222:$G$224,4,TRUE))))*1.1494","v":6919.3879999999999},{"$f":"(IF($F$18=0,0,(VLOOKUP($F$18,Tablas!$A$222:$G$224,5,TRUE))))*1.1494","v":5267.7002000000002},{"$f":"(IF($F$18=0,0,(VLOOKUP($F$18,Tablas!$A$222:$G$224,6,TRUE))))*1.1494","v":3848.1911999999998}]
[null,null,null,null,"Total de Prima neta",null,{"$f":"(SUM(G27:G29))","v":88077.372600000002},{"$f":"(SUM(H27:H29))","v":79931.574800000002},{"$f":"(SUM(I27:I29))","v":57444.713199999998},{"$f":"(SUM(J27:J29))","v":41968.042200000004}]
{"$rows_left_out":45}
{"sheet":"Global Select Health Plan","index":4,"n_rows":73,"n_cols":10,"rows_kept":73,"cut":false,"hidden":false,"merged":[[72,4,73,9],[25,4,25,9],[35,4,35,9],[46,4,46,9],[59,4,59,9],[71,4,71,9],[63,4,63,5],[64,4,64,5],[56,0,56,1],[60,0,60,1],[71,0,71,1],[75,0,75,1],[85,0,85,1],[40,1,41,1],[40,0,41,0],[50,4,50,5],[51,4,51,5],[20,0,20,1],[34,0,34,1],[39,0,39,1],[11,3,11,4],[15,3,15,4],[11,5,11,8],[13,5,13,8],[11,0,11,1]]}
[]
[]
[null,null,null,null,null,null,null," "," "," "]
[]
[]
[]
[null,null,null,null,null,null,null," "," "," "]
[]
[]
[]
[]
["Global Select Health Plan",null,null,"Nombre del Asegurado Titular:",null,{"$f":"+'INGRESO DE DATOS'!$D$15","v":"JOHN DOE"}]
[]
[null,null,null,null,"Cotizado por:",{"$f":"+'INGRESO DE DATOS'!$D$21","v":"NOMBRE DE AGENTE"}]
[]
[null,null,null,"Número de adultos en la póliza:",null,{"$f":"+'INGRESO DE DATOS'!$D$17","v":2},null,"Edad del Asegurado Titular:",{"$f":"+'INGRESO DE DATOS'!$D$19","v":65}]
[]
[null,null,null,null,"Número de niños en la póliza:",{"$f":"+'INGRESO DE DATOS'!$H$17","v":3},null,"Edad del/la conyuge:",{"$f":"+'INGRESO DE DATOS'!$H$19","v":71}]
[null,null,null,null,null,null,null," "," "]
[null,null,null,null,"Fecha de la cotización:",{"$f":"NOW()","v":"2022-12-06T15:03:42.210"}]
[]
[null,null,null,null,"Deducibles",null,"PLAN 1","PLAN 2","PLAN 3","PLAN 4"]
[null,null,null,null,"En el país de residencia",null,250,2000,5000,10000]
[null,null,null,null,"Fuera del país de residencia",null,5000,2000,5000,10000]
[]
[null,null,null,null,"Tarifas Anuales"]
[null,null,null,null,"Prima para Asegurado Titular",null,{"$f":"(VLOOKUP($I$16,Tablas!$A$305:$G$371,3,TRUE))*1.1494","v":21455.8498},{"$f":"(VLOOKUP($I$16,Tablas!$A$305:$G$371,4,TRUE))*1.1494","v":20588.052800000001},{"$f":"(VLOOKUP($I$16,Tablas!$A$305:$G$371,5,TRUE))*1.1494","v":14687.0332},{"$f":"(VLOOKUP($I$16,Tablas!$A$305:$G$371,6,TRUE))*1.1494","v":10726.200800000001}]
[null,null,null,null,"Prima para conyuge",null,{"$f":"(IF($F$16=1,0,(VLOOKUP($I$18,Tablas!$A$305:$G$371,3,TRUE))))*1.1494","v":36342.878599999996},{"$f":"(IF($F$16=1,0,(VLOOKUP($I$18,Tablas!$A$305:$G$371,4,TRUE))))*1.1494","v":34869.347799999996},{"$f":"(IF($F$16=1,0,(VLOOKUP($I$18,Tablas!$A$305:$G$371,5,TRUE))))*1.1494","v":25030.483799999998},{"$f":"(IF($F$16=1,0,(VLOOKUP($I$18,Tablas!$A$305:$G$371,6,TRUE))))*1.1494","v":18276.609400000001}]
[null,null,null,null,"Prima para hijo (s)",null,{"$f":"(IF($F$18=0,0,(VLOOKUP($F$18,Tablas!$A$372:$G$374,3,TRUE))))*1.1494","v":5333.2160000000003},{"$f":"(IF($F$18=0,0,(VLOOKUP($F$18,Tablas!$A$372:$G$374,4,TRUE))))*1.1494","v":5114.83},{"$f":"(IF($F$18=0,0,(VLOOKUP($F$18,Tablas!$A$372:$G$374,5,TRUE))))*1.1494","v":3917.1552000000001},{"$f":"(IF($F$18=0,0,(VLOOKUP($F$18,Tablas!$A$372:$G$374,6,TRUE))))*1.1494","v":2860.8566000000001}]
[null,null,null,null,"Total de Prima neta",null,{"$f":"(SUM(G27:G29))","v":63131.944399999993},{"$f":"(SUM(H27:H29))","v":60572.230599999995},{"$f":"(SUM(I27:I29))","v":43634.672200000001},{"$f":"(SUM(J27:J29))","v":31863.666799999999}]
{"$rows_left_out":44}
{"sheet":"Global Major Medical Health  Pl","index":5,"n_rows":128,"n_cols":22,"rows_kept":128,"cut":false,"hidden":false,"merged":[[20,0,20,1],[35,0,35,1],[86,0,86,1],[40,0,40,1],[57,0,57,1],[61,0,61,1],[72,0,72,1],[76,0,76,1],[41,0,42,0],[41,1,42,1],[46,4,46,7],[17,3,17,4],[11,0,11,1],[71,4,73,7],[70,4,70,7],[50,4,50,5],[51,4,51,5],[62,4,62,5],[63,4,63,5],[58,4,58,7],[11,3,11,4],[11,5,11,8],[15,3,15,4],[35,4,35,7],[25,4,25,7],[13,5,13,8]]}
[]
[]
[null,null,null,null,null,null,null," "," "," "]
[]
[]
[]
[null,null,null,null,null,null,null," "," "," "]
[]
[]
[]
[]
["Global Major Medical Health Plan",null,null,"Nombre del Asegurado Titular:",null,{"$f":"+'INGRESO DE DATOS'!$D$15","v":"JOHN DOE"}]
[]
[null,null,null,null,"Cotizado Por:",{"$f":"+'INGRESO DE DATOS'!$D$21","v":"NOMBRE DE AGENTE"}]
[]
[null,null,null,"Número de adultos en la póliza:",null,{"$f":"+'INGRESO DE DATOS'!$D$17","v":2},null,"Edad del Asegurado Titular:",{"$f":"+'INGRESO DE DATOS'!$D$19","v":65}]
[]
[null,null,null,"Número de niños en la póliza:",null,{"$f":"+'INGRESO DE DATOS'!$H$17","v":3},null,"Edad del/la conyuge:",{"$f":"+'INGRESO DE DATOS'!$H$19","v":71}]
[null,null,null,null,null,null,null," "," "]
[null,null,null,null,"Fecha de la cotización:",{"$f":"NOW()","v":"2022-12-06T15:03:42.210"}]
[null,null,null,null,null,null," ",false,null," "]
[null,null,null,null,"Deducibles",null,"PLAN 1","PLAN 2"]
[null,null,null,null,"En el país de residencia",null,10000,20000]
[null,null,null,null,"Fuera del país de residencia",null,10000,20000]
[]
[null,null,null,null,"Tarifas Anuales"]
[null,null,null,null,"Prima para Asegurado Titular",null,{"$f":"(VLOOKUP($I$16,Tablas!$A$1129:$G$1195,3,TRUE))*1.1494","v":12456.0478},{"$f":"(VLOOKUP($I$16,Tablas!$A$1129:$G$1195,4,TRUE))*1.1494","v":9799.7844000000005}]
[null,null,null,null,"Prima para conyuge",null,{"$f":"(IF($F$16=1,0,(VLOOKUP($I$18,Tablas!$A$1129:$G$1195,3,TRUE))))*1.1494","v":20671.958999999999},{"$f":"(IF($F$16=1,0,(VLOOKUP($I$18,Tablas!$A$1129:$G$1195,4,TRUE))))*1.1494","v":16678.9434}]
[null,null,null,null,"Prima para hijo (s)",null,{"$f":"(IF($F$18=0,0,(VLOOKUP($F$18,Tablas!$A$1196:$G$1198,3,TRUE))))*1.1494","v":3129.8161999999998},{"$f":"(IF($F$18=0,0,(VLOOKUP($F$18,Tablas!$A$1196:$G$1198,4,TRUE))))*1.1494","v":2455.1183999999998}]
[null,null,null,null,"Total de Prima neta",null,{"$f":"(SUM(G27:G29))","v":36257.823000000004},{"$f":"(SUM(H27:H29))","v":28933.8462}]
{"$rows_left_out":99}
{"sheet":"Resumen tarifas","index":6,"n_rows":106,"n_cols":8,"rows_kept":106,"cut":false,"hidden":false,"merged":[[104,0,104,7],[70,4,70,7],[77,4,77,7],[79,4,79,7],[81,4,81,7],[83,4,83,7],[78,0,78,1],[91,0,91,1],[92,0,92,1],[74,1,74,3],[77,0,77,1],[101,0,101,3],[100,0,100,3],[64,4,64,7],[66,4,66,7],[68,4,68,7],[50,3,50,7],[52,3,52,7],[54,3,54,7],[22,2,22,6],[58,0,58,2],[53,0,53,1],[54,0,54,1],[55,0,55,1],[38,2,38,3],[40,2,40,3],[41,0,41,1],[27,0,27,1],[50,0,50,1],[51,0,51,1],[42,2,42,3],[52,0,52,1],[56,3,56,7],[105,0,107,6],[87,0,87,1],[90,0,90,1],[79,0,79,1],[86,0,86,2],[90,2,90,3],[82,0,82,1],[80,0,80,1],[81,0,81,1],[93,0,93,1],[102,0,102,1],[92,2,92,3],[94,2,94,3],[94,0,94,1],[95,0,95,1],[96,2,96,3],[19,0,19,6],[46,0,46,1],[21,2,21,6],[24,4,24,5],[27,4,27,5],[32,0,32,1],[33,0,33,1],[36,0,36,1],[37,0,37,1],[38,0,38,1],[39,0,39,1],[40,0,40,1],[44,0,44,1],[36,2,36,3],[21,0,21,1],[24,0,24,1],[61,0,61,1],[69,0,69,1],[64,0,64,1],[65,0,65,1],[66,0,66,1],[67,0,67,1],[68,0,68,1]]}
[]
[null,null,null,null," "," "]
[]
[]
[]
[null,null,null,null," "," "," "]
[]
[]
[]
[]
[]
[]
[]
[]
[]
[]
[]
[]
[]
["Cotización de Seguro Médico - Global Health Plans"]
[]
["Nombre del Asegurado Titular",null,{"$f":"+'INGRESO DE DATOS'!$D$15","v":"JOHN DOE"}]
[null,"Cotizado por",{"$f":"+'INGRESO DE DATOS'!$D$21","v":"NOMBRE DE AGENTE"}]
[]
["Número de adultos en la póliza",null,{"$f":"+'INGRESO DE DATOS'!$D$17","v":2},null,"Edad del Asegurado Titular",null,{"$f":"+'INGRESO DE DATOS'!$D$19","v":65}]
[]
[]
["Número de niños en la póliza",null,{"$f":"+'INGRESO DE DATOS'!$H$17","v":3},null,"Edad del/la cónyuge ",null,{"$f":"+'INGRESO DE DATOS'!$H$19","v":71}]
[]
[]
{"$rows_left_out":77}
{"sheet":"Tablas","index":7,"n_rows":1497,"n_cols":25,"rows_kept":1497,"cut":false,"hidden":true,"merged":[[1424,0,1424,6],[1425,0,1425,1],[1425,2,1425,6],[1348,0,1348,6],[1349,0,1349,6],[1350,0,1350,1],[1350,2,1350,6],[1423,0,1423,6],[1200,0,1200,1],[1200,2,1200,6],[1273,0,1273,6],[1274,0,1274,6],[1275,0,1275,1],[1275,2,1275,6],[1124,0,1124,6],[1125,0,1125,6],[1126,0,1126,1],[1126,2,1126,6],[1199,0,1199,6],[976,0,976,1],[976,2,976,6],[1049,0,1049,6],[1050,0,1050,6],[1051,0,1051,1],[1051,2,1051,6],[900,0,900,6],[901,0,901,6],[902,0,902,1],[902,2,902,6],[975,0,975,6],[1,0,1,6],[2,0,2,6],[77,0,77,1],[77,2,77,6],[76,0,76,6],[3,0,3,1],[3,2,3,6],[376,0,376,1],[376,2,376,6],[150,0,150,6],[151,0,151,6],[152,0,152,1],[152,2,152,6],[225,0,225,6],[226,0,226,1],[375,0,375,6],[226,2,226,6],[300,0,300,6],[301,0,301,6],[302,0,302,1],[302,2,302,6],[526,0,526,6],[450,0,450,6],[451,0,451,6],[452,0,452,1],[452,2,452,6],[525,0,525,6],[527,0,527,1],[527,2,527,6],[600,0,600,6],[601,0,601,6],[602,0,602,1],[602,2,602,6],[751,0,751,6],[675,0,675,6],[676,0,676,6],[677,0,677,1],[677,2,677,6],[750,0,750,6],[752,0,752,1],[752,2,752,6],[825,0,825,6],[826,0,826,6],[827,0,827,1],[827,2,827,6]]}
[]
["BUPA GLOBAL ELITE",null,null,null,null,null,null,null,"FACTOR MENSUAL:",null,9.3333333333333338E-2]
["TARIFAS ANUALES",null,null,null,null,null,null,null,"FACTOR TRIMESTRAL:",null,0.27500000000000002]
["EDAD",null,null,null,null,null,null,null,"FACTOR SEMIANUAL:",null,0.53,null,null,null,null,null,null,null,null,null,"Bupa Bolivia 2023 Marketing Rates - USD - wout Tax 20221013 (1)"]
[" "," ",250,2000,3500,5000,10000,null,null,null,null,null,null,null,null,null,null,null,null,null,2,6,10,14,18]
[18,18,9953,8722,7245,6286,4787,null,null,null,null,null,null,null,null,null,null,null,null,null,0,0,0,0,0]
[19,18,9953,8722,7245,6286,4787,null,null,null,null,null,null,null,null,null,null,null,null,null,0,0,0,0,0]
[20,18,9953,8722,7245,6286,4787,null,null,null,null,null,null,null,null,null,null,null,null,null,0,0,0,0,0]
[21,18,9953,8722,7245,6286,4787,null,null,null,null,null,null,null,null,null,null,null,null,null,0,0,0,0,0]
[22,18,9953,8722,7245,6286,4787,null,null,null,null,null,null,null,null,null,null,null,null,null,0,0,0,0,0]
[23,18,9953,8722,7245,6286,4787,null,null,null,null,null,null,null,null,null,null,null,null,null,0,0,0,0,0]
[24,18,9953,8722,7245,6286,4787,null,null,null,null,null,null,null,null,null,null,null,null,null,0,0,0,0,0]
[25,25,10634,9320,7695,6672,5085,null,null,null,null,null,null,null,null,null,null,null,null,null,0,0,0,0,0]
[26,25,10634,9320,7695,6672,5085,null,null,null,null,null,null,null,null,null,null,null,null,null,0,0,0,0,0]
[27,25,10634,9320,7695,6672,5085,null,null,null,null,null,null,null,null,null,null,null,null,null,0,0,0,0,0]
[28,25,10634,9320,7695,6672,5085,null,null,null,null,null,null,null,null,null,null,null,null,null,0,0,0,0,0]
[29,25,10634,9320,7695,6672,5085,null,null,null,null,null,null,null,null,null,null,null,null,null,0,0,0,0,0]
[30,30,11825,10365,8494,7364,5609,null,null,null,null,null,null,null,null,null,null,null,null,null,0,0,0,0,0]
[31,30,11825,10365,8494,7364,5609,null,null,null,null,null,null,null,null,null,null,null,null,null,0,0,0,0,0]
[32,30,11825,10365,8494,7364,5609,null,null,null,null,null,null,null,null,null,null,null,null,null,0,0,0,0,0]
[33,30,11825,10365,8494,7364,5609,null,null,null,null,null,null,null,null,null,null,null,null,null,0,0,0,0,0]
[34,30,11825,10365,8494,7364,5609,null,null,null,null,null,null,null,null,null,null,null,null,null,0,0,0,0,0]
[35,35,13200,11567,9425,8174,6226,null,null,null,null,null,null,null,null,null,null,null,null,null,0,0,0,0,0]
[36,35,13200,11567,9425,8174,6226,null,null,null,null,null,null,null,null,null,null,null,null,null,0,0,0,0,0]
[37,35,13200,11567,9425,8174,6226,null,null,null,null,null,null,null,null,null,null,null,null,null,0,0,0,0,0]
[38,35,13200,11567,9425,8174,6226,null,null,null,null,null,null,null,null,null,null,null,null,null,0,0,0,0,0]
[39,35,13200,11567,9425,8174,6226,null,null,null,null,null,null,null,null,null,null,null,null,null,0,0,0,0,0]
[40,40,15277,13389,10860,9417,7175,null,null,null,null,null,null,null,null,null,null,null,null,null,0,0,0,0,0]
[41,40,15277,13389,10860,9417,7175,null,null,null,null,null,null,null,null,null,null,null,null,null,0,0,0,0,0]
[42,40,15277,13389,10860,9417,7175,null,null,null,null,null,null,null,null,null,null,null,null,null,0,0,0,0,0]
{"$rows_left_out":1467}