{"text_format":"1","workbook":"xlsx","n_sheets":3,"sheets":["INGRESO DE DATOS","Bupa Alpha","Tablas"],"not_rendered":{"charts":0,"images":2,"macros":1,"external_links":0,"defined_names":1,"comments":1,"pivot_tables":0},"unopened":[],"bounds":{"document_bytes":16777216,"sheet_cells":100000,"rows_first":2000,"rows_last":500,"rows_between":2000,"halvings":0,"cell_chars":16384,"cell_head_chars":4096},"cells_cut":0,"cells_raw":0,"read":"whole","date_system":"1900"}

{"sheet":"INGRESO DE DATOS","index":0,"n_rows":26,"n_cols":12,"rows_kept":26,"cut":false,"hidden":false,"merged":[[7,0,7,9],[14,3,14,9],[9,2,9,3],[23,3,23,9]]}
[]
[null,null,null,null,null,null,null,null," "," "," "]
[null,4]
[]
[]
[null,null,null,null,null,null,null,null," "," "," "," "]
[]
["COTIZACIÓN DE SEGURO MÉDICO"]
[]
["SELECCIONE EL PAIS:",null,"ARGENTINA"]
[]
[]
["INGRESE LOS DATOS DEL PROPUESTO ASEGURADO:"]
[]
[null,null,"Nombre del Asegurado principal:","NOMBRE Y APELLIDO"]
[]
[null,null,null,null,null,"Número de adultos en la póliza: ",1,null,"Número de hijos en la póliza: ",0]
[]
[null,null,null,null,null," Edad del titular: ",23,null,"Edad de cónyuge: ",19]
[]
[]
["INGRESE EL NOMBRE DE LA AGENCIA ASESORA:"]
[]
[null,null,"Nombre de la Agencia :","AGENCIA"]
[]
["4. ESCOJA EL PRODUCTO PARA VISUALIZAR LA COTIZACION RESPECTIVA :"]

{"sheet":"Bupa Alpha","index":1,"n_rows":50,"n_cols":11,"rows_kept":50,"cut":false,"hidden":false,"merged":[[9,0,9,1],[11,5,11,10],[48,3,48,10],[46,0,46,1],[49,3,51,10],[16,3,16,4],[28,3,28,10],[38,3,38,10],[9,5,9,7],[13,5,13,10]]}
[]
[null,null,null,null,null,null,null," "," "," "]
[]
[]
[]
[null,null,null,null,null,null,null," "," "," "," "]
[]
[]
[]
["Cotización de Seguro Médico - Bupa ALPHA",null,null,null,"País: ",{"$f":"+'INGRESO DE DATOS'!$C$10","v":"ARGENTINA"}]
[]
[null,null,null,null,"Nombre del asegurado :",{"$f":"+'INGRESO DE DATOS'!$D$15","v":"NOMBRE Y APELLIDO"}]
[]
[null,null,null,null,"Broker / Agente :",{"$f":"+'INGRESO DE DATOS'!$D$24","v":"AGENCIA"}]
[]
[null,null,null,null,null,null,"Número de adultos en la póliza:",{"$f":"+'INGRESO DE DATOS'!$G$17","v":1},null,"Edad de Titular :",{"$f":"+'INGRESO DE DATOS'!$G$19","v":23}]
[]
[null,null,null,null,null,null,"Número hijos (menos 24 de años):",{"$f":"+'INGRESO DE DATOS'!$J$17","v":0},null,"Edad de Cónyuge:",{"$f":"+'INGRESO DE DATOS'!$J$19","v":19}]
[null,null,null,null,null,null,null," "," "," "]
[null,null,null,null,null,null,"Fecha de cotización: ",{"$f":"NOW()","v":"2023-01-24T12:00:43.390"}]
[]
[null,null,null,null,null,null,true,null,"COMPLICACIONES DE MATERNIDAD"]
[]
[null,null,null,null,null,null,true,null,"TRASPLANTE DE ORGANOS"]
[]
[null,null,null,"Deducibles",null,null,"PLAN 2","PLAN 3","PLAN 4","PLAN 5","PLAN 6"]
[null,null,null,"Dentro o fuera del pais de residencia",null,null,1000,2000,5000,10000,20000]
[]
[null,null,null,"Tarifas Anuales"]
[null,null,null,"Prima de Titular :",null,null,{"$f":"IF(OR($F10=\"CHILE\",$F10=\"HAITI\",$F10=\"HONDURAS\"),VLOOKUP($K$16,Tablas!$A$6:$H$68,4,TRUE),IF(OR($F10=\"COSTA RICA\",$F10=\"EL SALVADOR\"),VLOOKUP($K$16,Tablas!$A$151:$H$213,4,TRUE),IF(OR($F10=\"BELIZE\",$F10=\"GUYANA\",$F10=\"NICARAGUA\",$F10=\"SURINAME\",$F10=\"URUGUAY\",$F10=\"CARIBBEAN\",$F10=\"PERU\"),VLOOKUP($K$16,Tablas!$A$296:$H$358,4,TRUE),IF($F10=\"VENEZUELA\",VLOOKUP($K$16,Tablas!$A$441:$H$503,4,TRUE),IF(OR($F10=\"ARGENTINA\",$F10=\"COLOMBIA\",$F10=\"PARAGUAY\"),VLOOKUP($K$16,Tablas!$A$586:$H$648,4,TRUE),0)))))","v":3701},{"$f":"IF(OR($F10=\"CHILE\",$F10=\"HAITI\",$F10=\"HONDURAS\"),VLOOKUP($K$16,Tablas!$A$6:$H$68,5,TRUE),IF(OR($F10=\"COSTA RICA\",$F10=\"EL SALVADOR\"),VLOOKUP($K$16,Tablas!$A$151:$H$213,5,TRUE),IF(OR($F10=\"BELIZE\",$F10=\"GUYANA\",$F10=\"NICARAGUA\",$F10=\"SURINAME\",$F10=\"URUGUAY\",$F10=\"CARIBBEAN\",$F10=\"PERU\"),VLOOKUP($K$16,Tablas!$A$296:$H$358,5,TRUE),IF($F10=\"VENEZUELA\",VLOOKUP($K$16,Tablas!$A$441:$H$503,5,TRUE),IF(OR($F10=\"ARGENTINA\",$F10=\"COLOMBIA\",$F10=\"PARAGUAY\"),VLOOKUP($K$16,Tablas!$A$586:$H$648,5,TRUE),0)))))","v":2925},{"$f":"IF(OR($F10=\"CHILE\",$F10=\"HAITI\",$F10=\"HONDURAS\"),VLOOKUP($K$16,Tablas!$A$6:$H$68,6,TRUE),IF(OR($F10=\"COSTA RICA\",$F10=\"EL SALVADOR\"),VLOOKUP($K$16,Tablas!$A$151:$H$213,6,TRUE),IF(OR($F10=\"BELIZE\",$F10=\"GUYANA\",$F10=\"NICARAGUA\",$F10=\"SURINAME\",$F10=\"URUGUAY\",$F10=\"CARIBBEAN\",$F10=\"PERU\"),VLOOKUP($K$16,Tablas!$A$296:$H$358,6,TRUE),IF($F10=\"VENEZUELA\",VLOOKUP($K$16,Tablas!$A$441:$H$503,6,TRUE),IF(OR($F10=\"ARGENTINA\",$F10=\"COLOMBIA\",$F10=\"PARAGUAY\"),VLOOKUP($K$16,Tablas!$A$586:$H$648,6,TRUE),0)))))","v":2242},{"$f":"IF(OR($F10=\"CHILE\",$F10=\"HAITI\",$F10=\"HONDURAS\"),VLOOKUP($K$16,Tablas!$A$6:$H$68,7,TRUE),IF(OR($F10=\"COSTA RICA\",$F10=\"EL SALVADOR\"),VLOOKUP($K$16,Tablas!$A$151:$H$213,7,TRUE),IF(OR($F10=\"BELIZE\",$F10=\"GUYANA\",$F10=\"NICARAGUA\",$F10=\"SURINAME\",$F10=\"URUGUAY\",$F10=\"CARIBBEAN\",$F10=\"PERU\"),VLOOKUP($K$16,Tablas!$A$296:$H$358,7,TRUE),IF($F10=\"VENEZUELA\",VLOOKUP($K$16,Tablas!$A$441:$H$503,7,TRUE),IF(OR($F10=\"ARGENTINA\",$F10=\"COLOMBIA\",$F10=\"PARAGUAY\"),VLOOKUP($K$16,Tablas!$A$586:$H$648,7,TRUE),0)))))","v":1941},{"$f":"IF(OR($F10=\"CHILE\",$F10=\"HAITI\",$F10=\"HONDURAS\"),VLOOKUP($K$16,Tablas!$A$6:$H$68,8,TRUE),IF(OR($F10=\"COSTA RICA\",$F10=\"EL SALVADOR\"),VLOOKUP($K$16,Tablas!$A$151:$H$213,8,TRUE),IF(OR($F10=\"BELIZE\",$F10=\"GUYANA\",$F10=\"NICARAGUA\",$F10=\"SURINAME\",$F10=\"URUGUAY\",$F10=\"CARIBBEAN\",$F10=\"PERU\"),VLOOKUP($K$16,Tablas!$A$296:$H$358,8,TRUE),IF($F10=\"VENEZUELA\",VLOOKUP($K$16,Tablas!$A$441:$H$503,8,TRUE),IF(OR($F10=\"ARGENTINA\",$F10=\"COLOMBIA\",$F10=\"PARAGUAY\"),VLOOKUP($K$16,Tablas!$A$586:$H$648,8,TRUE),0)))))","v":1473}]
[null,null,null,"Prima de Cónyuge",null,null,{"$f":"IF($H$16=1,0,IF(OR($F10=\"CHILE\",$F10=\"HAITI\",$F10=\"HONDURAS\"),VLOOKUP($K$18,Tablas!$A$6:$H$68,4,TRUE),IF(OR($F10=\"COSTA RICA\",$F10=\"EL SALVADOR\"),VLOOKUP($K$18,Tablas!$A$151:$H$213,4,TRUE),IF(OR($F10=\"BELIZE\",$F10=\"GUYANA\",$F10=\"NICARAGUA\",$F10=\"SURINAME\",$F10=\"URUGUAY\",$F10=\"CARIBBEAN\",$F10=\"PERU\"),VLOOKUP($K$18,Tablas!$A$296:$H$358,4,TRUE),IF($F10=\"VENEZUELA\",VLOOKUP($K$18,Tablas!$A$441:$H$503,4,TRUE),IF(OR($F10=\"ARGENTINA\",$F10=\"COLOMBIA\",$F10=\"PARAGUAY\"),VLOOKUP($K$18,Tablas!$A$586:$H$648,4,TRUE),0))))))","v":0},{"$f":"IF($H$16=1,0,IF(OR($F10=\"CHILE\",$F10=\"HAITI\",$F10=\"HONDURAS\"),VLOOKUP($K$18,Tablas!$A$6:$H$68,5,TRUE),IF(OR($F10=\"COSTA RICA\",$F10=\"EL SALVADOR\"),VLOOKUP($K$18,Tablas!$A$151:$H$213,5,TRUE),IF(OR($F10=\"BELIZE\",$F10=\"GUYANA\",$F10=\"NICARAGUA\",$F10=\"SURINAME\",$F10=\"URUGUAY\",$F10=\"CARIBBEAN\",$F10=\"PERU\"),VLOOKUP($K$18,Tablas!$A$296:$H$358,5,TRUE),IF($F10=\"VENEZUELA\",VLOOKUP($K$18,Tablas!$A$441:$H$503,5,TRUE),IF(OR($F10=\"ARGENTINA\",$F10=\"COLOMBIA\",$F10=\"PARAGUAY\"),VLOOKUP($K$18,Tablas!$A$586:$H$648,5,TRUE),0))))))","v":0},{"$f":"IF($H$16=1,0,IF(OR($F10=\"CHILE\",$F10=\"HAITI\",$F10=\"HONDURAS\"),VLOOKUP($K$18,Tablas!$A$6:$H$68,6,TRUE),IF(OR($F10=\"COSTA RICA\",$F10=\"EL SALVADOR\"),VLOOKUP($K$18,Tablas!$A$151:$H$213,6,TRUE),IF(OR($F10=\"BELIZE\",$F10=\"GUYANA\",$F10=\"NICARAGUA\",$F10=\"SURINAME\",$F10=\"URUGUAY\",$F10=\"CARIBBEAN\",$F10=\"PERU\"),VLOOKUP($K$18,Tablas!$A$296:$H$358,6,TRUE),IF($F10=\"VENEZUELA\",VLOOKUP($K$18,Tablas!$A$441:$H$503,6,TRUE),IF(OR($F10=\"ARGENTINA\",$F10=\"COLOMBIA\",$F10=\"PARAGUAY\"),VLOOKUP($K$18,Tablas!$A$586:$H$648,6,TRUE),0))))))","v":0},{"$f":"IF($H$16=1,0,IF(OR($F10=\"CHILE\",$F10=\"HAITI\",$F10=\"HONDURAS\"),VLOOKUP($K$18,Tablas!$A$6:$H$68,7,TRUE),IF(OR($F10=\"COSTA RICA\",$F10=\"EL SALVADOR\"),VLOOKUP($K$18,Tablas!$A$151:$H$213,7,TRUE),IF(OR($F10=\"BELIZE\",$F10=\"GUYANA\",$F10=\"NICARAGUA\",$F10=\"SURINAME\",$F10=\"URUGUAY\",$F10=\"CARIBBEAN\",$F10=\"PERU\"),VLOOKUP($K$18,Tablas!$A$296:$H$358,7,TRUE),IF($F10=\"VENEZUELA\",VLOOKUP($K$18,Tablas!$A$441:$H$503,7,TRUE),IF(OR($F10=\"ARGENTINA\",$F10=\"COLOMBIA\",$F10=\"PARAGUAY\"),VLOOKUP($K$18,Tablas!$A$586:$H$648,7,TRUE),0))))))","v":0},{"$f":"IF($H$16=1,0,IF(OR($F10=\"CHILE\",$F10=\"HAITI\",$F10=\"HONDURAS\"),VLOOKUP($K$18,Tablas!$A$6:$H$68,8,TRUE),IF(OR($F10=\"COSTA RICA\",$F10=\"EL SALVADOR\"),VLOOKUP($K$18,Tablas!$A$151:$H$213,8,TRUE),IF(OR($F10=\"BELIZE\",$F10=\"GUYANA\",$F10=\"NICARAGUA\",$F10=\"SURINAME\",$F10=\"URUGUAY\",$F10=\"CARIBBEAN\",$F10=\"PERU\"),VLOOKUP($K$18,Tablas!$A$296:$H$358,8,TRUE),IF($F10=\"VENEZUELA\",VLOOKUP($K$18,Tablas!$A$441:$H$503,8,TRUE),IF(OR($F10=\"ARGENTINA\",$F10=\"COLOMBIA\",$F10=\"PARAGUAY\"),VLOOKUP($K$18,Tablas!$A$586:$H$648,8,TRUE),0))))))","v":0}]
[null,null,null,"Primas Hijos :",null,null,{"$f":"IF($H$18=0,0,IF(OR($F10=\"CHILE\",$F10=\"HAITI\",$F10=\"HONDURAS\"),VLOOKUP($H$18,Tablas!$A$69:$H$71,4,TRUE),IF(OR($F10=\"COSTA RICA\",$F10=\"EL SALVADOR\"),VLOOKUP($H$18,Tablas!$A$214:$H$216,4,TRUE),IF(OR($F10=\"BELIZE\",$F10=\"GUYANA\",$F10=\"NICARAGUA\",$F10=\"SURINAME\",$F10=\"URUGUAY\",$F10=\"CARIBBEAN\",$F10=\"PERU\"),VLOOKUP($H$18,Tablas!$A$359:$H$361,4,TRUE),IF($F10=\"VENEZUELA\",VLOOKUP($H$18,Tablas!$A$504:$H$506,4,TRUE),IF(OR($F10=\"ARGENTINA\",$F10=\"COLOMBIA\",$F10=\"PARAGUAY\"),VLOOKUP($H$18,Tablas!$A$649:$H$651,4,TRUE),0))))))","v":0},{"$f":"IF($H$18=0,0,IF(OR($F10=\"CHILE\",$F10=\"HAITI\",$F10=\"HONDURAS\"),VLOOKUP($H$18,Tablas!$A$69:$H$71,5,TRUE),IF(OR($F10=\"COSTA RICA\",$F10=\"EL SALVADOR\"),VLOOKUP($H$18,Tablas!$A$214:$H$216,5,TRUE),IF(OR($F10=\"BELIZE\",$F10=\"GUYANA\",$F10=\"NICARAGUA\",$F10=\"SURINAME\",$F10=\"URUGUAY\",$F10=\"CARIBBEAN\",$F10=\"PERU\"),VLOOKUP($H$18,Tablas!$A$359:$H$361,5,TRUE),IF($F10=\"VENEZUELA\",VLOOKUP($H$18,Tablas!$A$504:$H$506,5,TRUE),IF(OR($F10=\"ARGENTINA\",$F10=\"COLOMBIA\",$F10=\"PARAGUAY\"),VLOOKUP($H$18,Tablas!$A$649:$H$651,5,TRUE),0))))))","v":0},{"$f":"IF($H$18=0,0,IF(OR($F10=\"CHILE\",$F10=\"HAITI\",$F10=\"HONDURAS\"),VLOOKUP($H$18,Tablas!$A$69:$H$71,6,TRUE),IF(OR($F10=\"COSTA RICA\",$F10=\"EL SALVADOR\"),VLOOKUP($H$18,Tablas!$A$214:$H$216,6,TRUE),IF(OR($F10=\"BELIZE\",$F10=\"GUYANA\",$F10=\"NICARAGUA\",$F10=\"SURINAME\",$F10=\"URUGUAY\",$F10=\"CARIBBEAN\",$F10=\"PERU\"),VLOOKUP($H$18,Tablas!$A$359:$H$361,6,TRUE),IF($F10=\"VENEZUELA\",VLOOKUP($H$18,Tablas!$A$504:$H$506,6,TRUE),IF(OR($F10=\"ARGENTINA\",$F10=\"COLOMBIA\",$F10=\"PARAGUAY\"),VLOOKUP($H$18,Tablas!$A$649:$H$651,6,TRUE),0))))))","v":0},{"$f":"IF($H$18=0,0,IF(OR($F10=\"CHILE\",$F10=\"HAITI\",$F10=\"HONDURAS\"),VLOOKUP($H$18,Tablas!$A$69:$H$71,7,TRUE),IF(OR($F10=\"COSTA RICA\",$F10=\"EL SALVADOR\"),VLOOKUP($H$18,Tablas!$A$214:$H$216,7,TRUE),IF(OR($F10=\"BELIZE\",$F10=\"GUYANA\",$F10=\"NICARAGUA\",$F10=\"SURINAME\",$F10=\"URUGUAY\",$F10=\"CARIBBEAN\",$F10=\"PERU\"),VLOOKUP($H$18,Tablas!$A$359:$H$361,7,TRUE),IF($F10=\"VENEZUELA\",VLOOKUP($H$18,Tablas!$A$504:$H$506,7,TRUE),IF(OR($F10=\"ARGENTINA\",$F10=\"COLOMBIA\",$F10=\"PARAGUAY\"),VLOOKUP($H$18,Tablas!$A$649:$H$651,7,TRUE),0))))))","v":0},{"$f":"IF($H$18=0,0,IF(OR($F10=\"CHILE\",$F10=\"HAITI\",$F10=\"HONDURAS\"),VLOOKUP($H$18,Tablas!$A$69:$H$71,8,TRUE),IF(OR($F10=\"COSTA RICA\",$F10=\"EL SALVADOR\"),VLOOKUP($H$18,Tablas!$A$214:$H$216,8,TRUE),IF(OR($F10=\"BELIZE\",$F10=\"GUYANA\",$F10=\"NICARAGUA\",$F10=\"SURINAME\",$F10=\"URUGUAY\",$F10=\"CARIBBEAN\",$F10=\"PERU\"),VLOOKUP($H$18,Tablas!$A$359:$H$361,8,TRUE),IF($F10=\"VENEZUELA\",VLOOKUP($H$18,Tablas!$A$504:$H$506,8,TRUE),IF(OR($F10=\"ARGENTINA\",$F10=\"COLOMBIA\",$F10=\"PARAGUAY\"),VLOOKUP($H$18,Tablas!$A$649:$H$651,8,TRUE),0))))))","v":0}]
[null,null,null,"Prima Rider Complic. Maternidad",null,null,{"$f":"+IF($G$22=FALSE,0,Tablas!D$72)","v":225},{"$f":"+IF($G$22=FALSE,0,Tablas!E$72)","v":225},{"$f":"+IF($G$22=FALSE,0,Tablas!F$72)","v":225},{"$f":"+IF($G$22=FALSE,0,Tablas!G$72)","v":225},{"$f":"+IF($G$22=FALSE,0,Tablas!H$72)","v":225}]
[null,null,null,"Prima Rider Trasplante Organos",null,null,{"$f":"+IF($G$24=FALSE,0,Tablas!D$73)","v":300},{"$f":"+IF($G$24=FALSE,0,Tablas!E$73)","v":300},{"$f":"+IF($G$24=FALSE,0,Tablas!F$73)","v":300},{"$f":"+IF($G$24=FALSE,0,Tablas!G$73)","v":300},{"$f":"+IF($G$24=FALSE,0,Tablas!H$73)","v":300}]
[null,null,null,"TOTAL PRIMA NETA :",null,null,{"$f":"SUM(G30:G34)","v":4226},3450,2767,2466,1998]
[null,null,null,"Costo Administrativo Anual :",null,null,75,75,75,75,75]
[null,null,null,"GRAN TOTAL :",null,null,{"$f":"SUM(G35:G36)","v":4301},{"$f":"SUM(H35:H36)","v":3525},{"$f":"SUM(I35:I36)","v":2842},{"$f":"SUM(J35:J36)","v":2541},{"$f":"SUM(K35:K36)","v":2073}]
[]
[null,null,null,"Tarifas Semestrales"]
[null,null,null,"Prima de Titular :",null,null,{"$f":"IF(OR($F10=\"CHILE\",$F10=\"HAITI\",$F10=\"HONDURAS\"),VLOOKUP($K$16,Tablas!$A$78:$H$140,4,TRUE),IF(OR($F10=\"COSTA RICA\",$F10=\"EL SALVADOR\"),VLOOKUP($K$16,Tablas!$A$223:$H$285,4,TRUE),IF(OR($F10=\"BELIZE\",$F10=\"GUYANA\",$F10=\"NICARAGUA\",$F10=\"SURINAME\",$F10=\"URUGUAY\",$F10=\"CARIBBEAN\",$F10=\"PERU\"),VLOOKUP($K$16,Tablas!$A$368:$H$430,4,TRUE),IF($F10=\"VENEZUELA\",VLOOKUP($K$16,Tablas!$A$513:$H$575,4,TRUE),IF(OR($F10=\"ARGENTINA\",$F10=\"COLOMBIA\",$F10=\"PARAGUAY\"),VLOOKUP($K$16,Tablas!$A$658:$H$720,4,TRUE),0)))))","v":1961.5300000000002},{"$f":"IF(OR($F10=\"CHILE\",$F10=\"HAITI\",$F10=\"HONDURAS\"),VLOOKUP($K$16,Tablas!$A$78:$H$140,5,TRUE),IF(OR($F10=\"COSTA RICA\",$F10=\"EL SALVADOR\"),VLOOKUP($K$16,Tablas!$A$223:$H$285,5,TRUE),IF(OR($F10=\"BELIZE\",$F10=\"GUYANA\",$F10=\"NICARAGUA\",$F10=\"SURINAME\",$F10=\"URUGUAY\",$F10=\"CARIBBEAN\",$F10=\"PERU\"),VLOOKUP($K$16,Tablas!$A$368:$H$430,5,TRUE),IF($F10=\"VENEZUELA\",VLOOKUP($K$16,Tablas!$A$513:$H$575,5,TRUE),IF(OR($F10=\"ARGENTINA\",$F10=\"COLOMBIA\",$F10=\"PARAGUAY\"),VLOOKUP($K$16,Tablas!$A$658:$H$720,5,TRUE),0)))))","v":1550.25},{"$f":"IF(OR($F10=\"CHILE\",$F10=\"HAITI\",$F10=\"HONDURAS\"),VLOOKUP($K$16,Tablas!$A$78:$H$140,6,TRUE),IF(OR($F10=\"COSTA RICA\",$F10=\"EL SALVADOR\"),VLOOKUP($K$16,Tablas!$A$223:$H$285,6,TRUE),IF(OR($F10=\"BELIZE\",$F10=\"GUYANA\",$F10=\"NICARAGUA\",$F10=\"SURINAME\",$F10=\"URUGUAY\",$F10=\"CARIBBEAN\",$F10=\"PERU\"),VLOOKUP($K$16,Tablas!$A$368:$H$430,6,TRUE),IF($F10=\"VENEZUELA\",VLOOKUP($K$16,Tablas!$A$513:$H$575,6,TRUE),IF(OR($F10=\"ARGENTINA\",$F10=\"COLOMBIA\",$F10=\"PARAGUAY\"),VLOOKUP($K$16,Tablas!$A$658:$H$720,6,TRUE),0)))))","v":1188.26},{"$f":"IF(OR($F10=\"CHILE\",$F10=\"HAITI\",$F10=\"HONDURAS\"),VLOOKUP($K$16,Tablas!$A$78:$H$140,7,TRUE),IF(OR($F10=\"COSTA RICA\",$F10=\"EL SALVADOR\"),VLOOKUP($K$16,Tablas!$A$223:$H$285,7,TRUE),IF(OR($F10=\"BELIZE\",$F10=\"GUYANA\",$F10=\"NICARAGUA\",$F10=\"SURINAME\",$F10=\"URUGUAY\",$F10=\"CARIBBEAN\",$F10=\"PERU\"),VLOOKUP($K$16,Tablas!$A$368:$H$430,7,TRUE),IF($F10=\"VENEZUELA\",VLOOKUP($K$16,Tablas!$A$513:$H$575,7,TRUE),IF(OR($F10=\"ARGENTINA\",$F10=\"COLOMBIA\",$F10=\"PARAGUAY\"),VLOOKUP($K$16,Tablas!$A$658:$H$720,7,TRUE),0)))))","v":1028.73},{"$f":"IF(OR($F10=\"CHILE\",$F10=\"HAITI\",$F10=\"HONDURAS\"),VLOOKUP($K$16,Tablas!$A$78:$H$140,8,TRUE),IF(OR($F10=\"COSTA RICA\",$F10=\"EL SALVADOR\"),VLOOKUP($K$16,Tablas!$A$223:$H$285,8,TRUE),IF(OR($F10=\"BELIZE\",$F10=\"GUYANA\",$F10=\"NICARAGUA\",$F10=\"SURINAME\",$F10=\"URUGUAY\",$F10=\"CARIBBEAN\",$F10=\"PERU\"),VLOOKUP($K$16,Tablas!$A$368:$H$430,8,TRUE),IF($F10=\"VENEZUELA\",VLOOKUP($K$16,Tablas!$A$513:$H$575,8,TRUE),IF(OR($F10=\"ARGENTINA\",$F10=\"COLOMBIA\",$F10=\"PARAGUAY\"),VLOOKUP($K$16,Tablas!$A$658:$H$720,8,TRUE),0)))))","v":780.69}]
{"$rows_left_out":11}
{"sheet":"Tablas","index":2,"n_rows":725,"n_cols":18,"rows_kept":725,"cut":false,"hidden":true,"merged":[[655,0,655,1],[655,2,655,6],[581,0,581,7],[582,0,582,7],[583,0,583,1],[583,2,583,6],[654,0,654,7],[438,0,438,1],[438,2,438,6],[509,0,509,7],[510,0,510,1],[510,2,510,6],[364,0,364,7],[365,0,365,1],[365,2,365,6],[436,0,436,7],[437,0,437,7],[220,0,220,1],[220,2,220,6],[291,0,291,7],[292,0,292,7],[293,0,293,1],[293,2,293,6],[146,0,146,7],[147,0,147,7],[148,0,148,1],[148,2,148,6],[219,0,219,7],[1,0,1,7],[2,0,2,7],[75,0,75,1],[75,2,75,6],[74,0,74,7],[3,0,3,1],[3,2,3,6]]}
[]
["BUPA ALPHA - ZONE 2",null,null,null,null,null,null,null,null,"FACTOR SEMESTRAL :",null,0.53,null,"PAISES"]
["TARIFAS ANUALES",null,null,null,null,null,null,null,null,null,null,null,null,"ARGENTINA",6]
["EDAD",null,null,null,null,null,null,null,null,null,null,null,null,"BELIZE",4]
[" "," ",null,"DW2","DW3","DW4","DW5","DW6","DW2","DW3","DW4","DW5","DW6","CARIBBEAN",4]
[18,null,null,3770,2921,2261,1952,1490,0,0,0,0,0,"CHILE",2,null,true,true]
[19,null,null,3869,3017,2326,2009,1531,0,0,0,0,0,"COLOMBIA",6,null,true,true]
[20,null,null,3973,3104,2393,2068,1575,0,0,0,0,0,"COSTA RICA",3,null,true,true]
[21,null,null,4079,3200,2458,2122,1616,0,0,0,0,0,"EL SALVADOR",3,null,true,true]
[22,null,null,4190,3299,2528,2187,1660,0,0,0,0,0,"GUYANA",4,null,true,true]
[23,null,null,4297,3403,2596,2243,1705,0,0,0,0,0,"HAITI",2,null,true,true]
[24,null,null,4404,3492,2670,2306,1748,0,0,0,0,0,"HONDURAS",2,null,true,true]
[25,null,null,4512,3593,2734,2368,1793,0,0,0,0,0,"NICARAGUA",4,null,true,true]
[26,null,null,4620,3692,2808,2426,1836,0,0,0,0,0,"PARAGUAY",6,null,true,true]
[27,null,null,4732,3790,2873,2488,1884,0,0,0,0,0,"PERU",4,null,true,true]
[28,null,null,4903,3922,2921,2540,1955,0,0,0,0,0,"SURINAME",4,null,true,true]
[29,null,null,5078,4051,2970,2594,2024,0,0,0,0,0,"URUGUAY",4,null,true,true]
[30,null,null,5251,4178,3018,2642,2096,0,0,0,0,0,"VENEZUELA",5,null,true,true]
[31,null,null,5421,4312,3060,2695,2164,0,0,0,0,0,null,null,null,true,true]
[32,null,null,5596,4442,3113,2746,2240,0,0,0,0,0,null,null,null,true,true]
[33,null,null,5712,4539,3189,2801,2292,0,0,0,0,0,null,null,null,true,true]
[34,null,null,5829,4635,3265,2863,2348,0,0,0,0,0,null,null,null,true,true]
[35,null,null,5944,4733,3347,2914,2403,0,0,0,0,0,null,null,null,true,true]
[36,null,null,6060,4832,3424,2972,2458,0,0,0,0,0,null,null,null,true,true]
[37,null,null,6180,4930,3496,3027,2512,0,0,0,0,0,null,null,null,true,true]
[38,null,null,6292,5037,3562,3086,2560,0,0,0,0,0,null,null,null,true,true]
[39,null,null,6409,5142,3619,3143,2612,0,0,0,0,0,null,null,null,true,true]
[40,null,null,6527,5251,3680,3200,2658,0,0,0,0,0,null,null,null,true,true]
[41,null,null,6639,5353,3739,3260,2712,0,0,0,0,0,null,null,null,true,true]
[42,null,null,6756,5465,3800,3317,2757,0,0,0,0,0,null,null,null,true,true]
[43,null,null,6992,5678,3943,3440,2864,0,0,0,0,0,null,null,null,true,true]
[44,null,null,7226,5891,4087,3570,2963,0,0,0,0,0,null,null,null,true,true]
[45,null,null,7463,6104,4231,3695,3068,0,0,0,0,0,null,null,null,true,true]
[46,null,null,7699,6323,4372,3817,3173,0,0,0,0,0,null,null,null,true,true]
[47,null,null,7934,6539,4517,3943,3272,0,0,0,0,0,null,null,null,true,true]
[48,null,null,8160,6653,4645,4055,3330,0,0,0,0,0,null,null,null,true,true]
[49,null,null,8387,6772,4773,4166,3390,0,0,0,0,0,null,null,null,true,true]
[50,null,null,8616,6892,4903,4281,3450,0,0,0,0,0,null,null,null,true,true]
[51,null,null,8846,7009,5032,4392,3509,0,0,0,0,0,null,null,null,true,true]
[52,null,null,9073,7127,5161,4503,3570,0,0,0,0,0,null,null,null,true,true]
{"$rows_left_out":685}