{"text_format":"1","workbook":"xlsx","n_sheets":6,"sheets":["INGRESO DE DATOS","Privilege-Care-International","Advantage (LA)","Secure-Care-International","Resumen-Tarifas-Anuales","Tablas"],"not_rendered":{"charts":0,"images":4,"macros":1,"external_links":0,"defined_names":0,"comments":1,"pivot_tables":0},"unopened":[],"bounds":{"document_bytes":16777216,"sheet_cells":100000,"rows_first":2000,"rows_last":500,"rows_between":2000,"halvings":0,"cell_chars":16384,"cell_head_chars":4096},"cells_cut":0,"cells_raw":0,"read":"whole","date_system":"1900"}

{"sheet":"INGRESO DE DATOS","index":0,"n_rows":23,"n_cols":12,"rows_kept":23,"cut":false,"hidden":false,"merged":[[10,1,10,2],[19,1,19,2],[14,7,14,8],[10,3,10,9],[19,3,19,6],[12,3,12,5],[12,7,12,8],[14,4,14,5]]}
[]
[null,null,null,null,null,null,null,null," "," "," "]
[]
[]
[]
[]
[null,null,null,null,null,null,null,null," "," "," "," "]
[]
["INGRESE LOS DATOS DEL PROPUESTO ASEGURADO: "]
[]
[null,"Nombre del Asegurado principal:",null,"NOMBRE Y APELLIDO"]
[]
[null,null,null,"Número de adultos en la póliza: ",null,null,2,"Número de hijos en la póliza: ",null,3]
[]
[null,null,null,null," Edad del titular: ",null,54,"Edad de cónyuge: ",null,54]
[]
[]
["INGRESE EL NOMBRE DE LA AGENCIA ASESORA: "]
[]
[null,"Nombre de la Agencia: ",null,"AGENCIA"]
[]
[]
["ESCOJA EL PRODUCTO PARA VISUALIZAR LA COTIZACIÓN RESPECTIVA: "]

{"sheet":"Privilege-Care-International","index":1,"n_rows":54,"n_cols":13,"rows_kept":54,"cut":false,"hidden":false,"merged":[[50,7,50,11],[43,2,43,3],[42,2,42,3],[33,2,33,3],[31,2,31,3],[32,2,32,3],[37,2,37,3],[41,2,41,3],[53,7,53,12],[14,7,14,12],[44,2,45,3],[34,2,34,3],[35,2,35,3],[32,7,32,12],[41,7,41,12],[16,7,16,12],[24,9,24,10],[24,7,24,8],[14,0,14,3],[15,0,15,1],[16,0,16,1],[17,0,17,1],[18,0,18,1],[52,7,52,12],[27,0,27,1],[16,2,16,3],[12,0,12,12],[19,0,19,1],[18,2,18,3],[17,2,17,3],[15,2,15,3],[19,2,19,3],[20,2,21,3],[27,2,27,3],[25,2,25,3],[11,0,11,12],[26,2,26,3],[22,2,22,3],[24,2,24,3],[22,0,22,1],[20,0,21,1],[23,0,24,1],[23,2,23,3],[25,0,26,1],[41,0,41,1],[32,0,32,1],[33,0,33,1],[44,0,45,1],[42,0,42,1],[43,0,43,1],[28,0,28,1],[40,2,40,3],[36,0,36,1],[37,0,37,1],[38,0,38,1],[39,0,39,1],[34,0,34,1],[40,0,40,1],[31,0,31,1],[35,0,35,1],[38,2,38,3],[39,2,39,3],[36,2,36,3],[29,0,30,1],[28,2,28,3],[29,2,30,3]]}
[]
[null,null,null,null,null,null,null,null,null," "," "," "]
[]
[]
[]
[null,null,null,null,null,null,null,null,null," "," "," "," "]
[]
[]
[]
[]
[]
["Cotización de Seguro Médico Internacional — PRIVILEGE CARE INTERNATIONAL"]
["ESTE PRODUCTO SOLO CUBRE GASTOS MEDICOS FUERA DE VENEZUELA"]
[]
["PRIVILEGE CARE INTERNATIONAL",null,null,null,null,null,null,{"$f":"+'INGRESO DE DATOS'!$D$11","v":"NOMBRE Y APELLIDO"}]
[]
[null,null,null,null,null,null,null,{"$f":"+'INGRESO DE DATOS'!$D$20","v":"AGENCIA"}]
[]
[null,null,null,null,null,null,null,null,null,{"$f":"+'INGRESO DE DATOS'!$G$13","v":2},null,null,{"$f":"+'INGRESO DE DATOS'!$G$15","v":54}]
[]
[null,null,null,null,null,null,null,null,null,{"$f":"+'INGRESO DE DATOS'!$J$13","v":3},null,null,{"$f":"+'INGRESO DE DATOS'!$J$15","v":54}]
[null,null,null,null,null,null,null,null,null," "," "," "]
[null,null,null,null,null,null,null,null,false,null,"COMPLICACIONES DE MATERNIDAD"]
[]
[null,null,null,null,null,null,null,"FECHA DE COTIZACION :",null,{"$f":"NOW()","v":"2023-01-17T12:25:17.500"}]
[]
[null,null,null,null,null,null," "]
[null,null,null,null,null,null,null,"Deducibles",null,"PLAN 1","PLAN 2","PLAN 3","PLAN 4"]
[null,null,null,null,null,null,null,"Dentro del pais de residencia",null,"n/a","n/a","n/a","n/a"]
[null,null,null,null,null,null,null,"Fuera del pais de residencia",null,2000,5000,10000,20000]
[]
[]
[null,null,null,null,null,null,null,"TARIFAS ANUALES"]
[null,null,null,null,null,null,null,"Prima de Titular :",null,{"$f":"VLOOKUP($M$19,Tablas!$A$140:$H$163,5,TRUE)","v":6076},{"$f":"VLOOKUP($M$19,Tablas!$A$140:$H$163,6,TRUE)","v":4319},{"$f":"VLOOKUP($M$19,Tablas!$A$140:$H$163,7,TRUE)","v":3562},{"$f":"VLOOKUP($M$19,Tablas!$A$140:$H$163,8,TRUE)","v":2723}]
[null,null,null,null,null,null,null,"Prima de Cónyuge",null,{"$f":"IF($J$19=1,0,(VLOOKUP($M$21,Tablas!$A$140:$H$163,5,TRUE)))","v":6076},{"$f":"IF($J$19=1,0,(VLOOKUP($M$21,Tablas!$A$140:$H$163,6,TRUE)))","v":4319},{"$f":"IF($J$19=1,0,(VLOOKUP($M$21,Tablas!$A$140:$H$163,7,TRUE)))","v":3562},{"$f":"IF($J$19=1,0,(VLOOKUP($M$21,Tablas!$A$140:$H$163,8,TRUE)))","v":2723}]
[null,null,null,null,null,null,null,"Primas Hijos :",null,{"$f":"IF($J$21=0,0,(VLOOKUP($J$21,Tablas!$A$164:$H$166,5,TRUE)))","v":2535},{"$f":"IF($J$21=0,0,(VLOOKUP($J$21,Tablas!$A$164:$H$166,6,TRUE)))","v":1801},{"$f":"IF($J$21=0,0,(VLOOKUP($J$21,Tablas!$A$164:$H$166,7,TRUE)))","v":1522},{"$f":"IF($J$21=0,0,(VLOOKUP($J$21,Tablas!$A$164:$H$166,8,TRUE)))","v":1124}]
[null,null,null,null,null,null,null,"Prima Rider Complic. Maternidad",null,{"$f":"+IF($I$23=FALSE,0,Tablas!F$167)","v":0},{"$f":"+IF($I$23=FALSE,0,Tablas!G$167)","v":0},{"$f":"+IF($I$23=FALSE,0,Tablas!H$167)","v":0},{"$f":"+IF($I$23=FALSE,0,Tablas!H$167)","v":0}]
[null,null,null,null,null,null,null,"TOTAL PRIMA NETA :",null,{"$f":"SUM(J34:J37)","v":14687},{"$f":"SUM(K34:K37)","v":10439},{"$f":"SUM(L34:L37)","v":8646},{"$f":"SUM(M34:M37)","v":6570}]
[null,null,null,null,null,null,null,"Costo Administrativo Anual :",null,75,75,75,75]
[null,null,null,null,null,null,null,"GRAN TOTAL :",null,{"$f":"SUM(J38:J39)","v":14762},{"$f":"SUM(K38:K39)","v":10514},{"$f":"SUM(L38:L39)","v":8721},{"$f":"SUM(M38:M39)","v":6645}]
{"$rows_left_out":15}
{"sheet":"Advantage (LA)","index":2,"n_rows":50,"n_cols":13,"rows_kept":50,"cut":false,"hidden":true,"merged":[[45,0,46,1],[42,0,42,1],[41,2,41,3],[42,2,42,3],[43,0,43,1],[43,2,43,3],[44,0,44,1],[44,2,44,3],[39,0,39,1],[40,0,40,1],[39,2,39,3],[41,0,41,1],[40,2,40,3],[22,0,23,1],[24,0,24,1],[33,0,33,1],[34,0,34,1],[38,2,38,3],[38,0,38,1],[35,0,35,1],[35,2,35,3],[36,0,36,1],[36,2,36,3],[34,2,34,3],[19,0,19,1],[28,0,28,1],[28,2,28,3],[32,0,32,1],[25,2,25,3],[25,0,25,1],[26,0,26,1],[26,2,26,3],[32,2,32,3],[21,2,21,3],[22,2,22,3],[31,2,31,3],[27,0,27,1],[29,0,29,1],[30,0,31,1],[20,0,21,1],[49,5,49,12],[12,2,12,3],[13,2,13,3],[14,2,14,3],[15,2,15,3],[27,2,27,3],[16,2,16,3],[20,2,20,3],[17,2,18,3],[29,2,29,3],[30,2,30,3],[23,2,23,3],[24,2,24,3],[19,2,19,3],[33,2,33,3],[45,2,46,3],[9,0,9,12],[11,7,11,12],[13,7,13,12],[17,5,17,6],[16,5,16,6],[11,0,11,3],[17,0,18,1],[12,0,12,1],[13,0,13,1],[14,0,14,1],[15,0,15,1],[16,0,16,1]]}
[]
[null,null,null,null,null,null,null,null,null," "," "," "]
[]
[]
[]
[null,null,null,null,null,null,null,null,null," "," "," "," "]
[]
[]
[]
["Cotización de Seguro Médico Internacional - Bupa ADVANTAGE Care (cobertura solo Latinoamérica)"]
[]
["Bupa Advantage Care (cobertura solo en Latinoamérica)",null,null,null,null,null,null,{"$f":"+'INGRESO DE DATOS'!$D$11","v":"NOMBRE Y APELLIDO"}]
["Cobertura Máxima anual",null,"US $ 3,500,000"]
["Cobertura Geografica",null,"Limitada a Latinoamérica excluyendo México",null,null,null,null,{"$f":"+'INGRESO DE DATOS'!$D$20","v":"AGENCIA"}]
["Condiciones médicas cubiertas",null,"Todas las condiciones médicas"]
["Redes de proveedores",null,"Red de Proveedores \"Bupa Advantage\"",null,null,null,null,null,null,{"$f":"+'INGRESO DE DATOS'!$G$13","v":2},null,null,{"$f":"+'INGRESO DE DATOS'!$G$15","v":54}]
["Opciones fuera de la Red",null,"NO, solo en casos de emergencia",null,null,"FECHA DE COTIZACION :"]
["Requiere preautorización",null,"SI, 30% de penalización por omitir prenotificación",null,null,{"$f":"NOW()","v":"2023-01-17T12:25:17.500"},null,null,null,{"$f":"+'INGRESO DE DATOS'!$J$13","v":3},null,null,{"$f":"+'INGRESO DE DATOS'!$J$15","v":54}]
[null,null,null,null,null,null,null,null,null," "," "," "]
["Número máximo de días de hospitalización",null,"Ilimitado",null,null,null,null,null,true,null,"COMPLICACIONES DE MATERNIDAD"]
["Habitación y alimentación",null,"100% dentro de Red Bupa"]
[null,null,"\"UCR\" para L.A. en emergencias fuera de  Red Bupa",null,null,null,null,null,true,null,"TRASPLANTE DE ORGANOS"]
["Cuidados Intensivos",null,"100% dentro de Red Bupa"]
[null,null,"\"UCR\" para L.A. en emergencias fuera de  Red Bupa",null,null,null," "]
["Cobertura de Maternidad",null,"$5,000 (Excepto planes 4,5, y 6)",null,null,"Deducibles",null,"PLAN 1","PLAN 2","PLAN 3","PLAN 4","PLAN 5","PLAN 6"]
["Cobertura Provisional de Recién Nacido",null,"$30,000 por los primeros 90 días",null,null,"Dentro del pais de residencia",null,"n/a",1000,2000,5000,10000,20000]
["Cuidado del Recién Nacido saludable",null,"Ya incluída dentro del beneficio de Maternidad",null,null,"Fuera del pais de residencia",null,"n/a",2000,3000,5000,10000,20000]
["Cobertura de Complicaciones de Maternidad",null,"Disponible a través de cobertura opcional adicional"]
["Trasplante de Organos",null,"$1,000,000 de por vida, por diagnóstico"]
["Condiciones congénitas y hereditarias",null,"<18 años $300,000 de por vida; >=18 al 100%",null,null,"Tarifas Anuales"]
["Coberturas opcionales (Riders)",null,"Complicaciones de Maternidad por $500,000",null,null,"Prima de Titular :",null,"n/a",{"$f":"VLOOKUP($M$16,Tablas!$A$341:$H$364,4,TRUE)","v":{"$error":"#N/A"}},{"$f":"VLOOKUP($M$16,Tablas!$A$341:$H$364,5,TRUE)","v":{"$error":"#N/A"}},{"$f":"VLOOKUP($M$16,Tablas!$A$341:$H$364,6,TRUE)","v":{"$error":"#N/A"}},{"$f":"VLOOKUP($M$16,Tablas!$A$341:$H$364,7,TRUE)","v":{"$error":"#N/A"}},{"$f":"VLOOKUP($M$16,Tablas!$A$341:$H$364,8,TRUE)","v":{"$error":"#N/A"}}]
[null,null,"Trasplante de órganos por $ 300,000 adicionales",null,null,"Prima de Cónyuge",null,"n/a",{"$f":"IF($J$16=1,0,(VLOOKUP($M$18,Tablas!$A$341:$H$364,4,TRUE)))","v":{"$error":"#N/A"}},{"$f":"IF($J$16=1,0,(VLOOKUP($M$18,Tablas!$A$341:$H$364,5,TRUE)))","v":{"$error":"#N/A"}},{"$f":"IF($J$16=1,0,(VLOOKUP($M$18,Tablas!$A$341:$H$364,6,TRUE)))","v":{"$error":"#N/A"}},{"$f":"IF($J$16=1,0,(VLOOKUP($M$18,Tablas!$A$341:$H$364,7,TRUE)))","v":{"$error":"#N/A"}},{"$f":"IF($J$16=1,0,(VLOOKUP($M$18,Tablas!$A$341:$H$364,8,TRUE)))","v":{"$error":"#N/A"}}]
["Acompañamiento de menores hospitalizados",null,"$300 por día",null,null,"Primas Hijos :",null,"n/a",{"$f":"IF($J$18=0,0,(VLOOKUP($J$18,Tablas!$A$365:$H$367,4,TRUE)))","v":{"$error":"#N/A"}},{"$f":"IF($J$18=0,0,(VLOOKUP($J$18,Tablas!$A$365:$H$367,5,TRUE)))","v":{"$error":"#N/A"}},{"$f":"IF($J$18=0,0,(VLOOKUP($J$18,Tablas!$A$365:$H$367,6,TRUE)))","v":{"$error":"#N/A"}},{"$f":"IF($J$18=0,0,(VLOOKUP($J$18,Tablas!$A$365:$H$367,7,TRUE)))","v":{"$error":"#N/A"}},{"$f":"IF($J$18=0,0,(VLOOKUP($J$18,Tablas!$A$365:$H$367,8,TRUE)))","v":{"$error":"#N/A"}}]
["Ambulancia aérea",null,"$100,000 por año y ticket aéreo de retorno",null,null,"Prima Rider Complic. Maternidad",null,"n/a",{"$f":"+IF($I$20=FALSE,0,Tablas!D$368)","v":0},{"$f":"+IF($I$20=FALSE,0,Tablas!E$368)","v":0},{"$f":"+IF($I$20=FALSE,0,Tablas!F$368)","v":0},{"$f":"+IF($I$20=FALSE,0,Tablas!G$368)","v":0},{"$f":"+IF($I$20=FALSE,0,Tablas!H$368)","v":0}]
["Repatriación restos mortales",null,1,null,null,"Prima Rider Trasplante Organos",null,"n/a",{"$f":"IF($I$22=FALSE,0,Tablas!D$369)","v":0},{"$f":"IF($I$22=FALSE,0,Tablas!E$369)","v":0},{"$f":"IF($I$22=FALSE,0,Tablas!F$369)","v":0},{"$f":"IF($I$22=FALSE,0,Tablas!G$369)","v":0},{"$f":"IF($I$22=FALSE,0,Tablas!H$369)","v":0}]
["Medicamentos por receta",null,"$6,000 por Asegurado, por año póliza",null,null,"TOTAL PRIMA NETA :",null,"n/a",{"$f":"SUM(I31:I35)","v":{"$error":"#N/A"}},{"$error":"#N/A"},{"$error":"#N/A"},{"$error":"#N/A"},{"$error":"#N/A"}]
["Almacenamiento de sangre de cordon umbilical",null,"$500  (Excepto planes 4,5, y 6)",null,null,"Costo Administrativo Anual :",null,"n/a",75,75,75,75,75]
[null,null,null,null,null,"GRAN TOTAL :",null,"n/a",{"$f":"SUM(I36:I37)","v":{"$error":"#N/A"}},{"$f":"SUM(J36:J37)","v":{"$error":"#N/A"}},{"$f":"SUM(K36:K37)","v":{"$error":"#N/A"}},{"$f":"SUM(L36:L37)","v":{"$error":"#N/A"}},{"$f":"SUM(M36:M37)","v":{"$error":"#N/A"}}]
["Atención médica en el hogar",null,"100% de usual/acostumbrado y razonable"]
["Rehabilitación",null,"100% de usual/acostumbrado y razonable",null,null,"Tarifas Semestrales"]
{"$rows_left_out":11}
{"sheet":"Secure-Care-International","index":3,"n_rows":62,"n_cols":13,"rows_kept":62,"cut":false,"hidden":false,"merged":[[60,7,60,12],[61,7,61,12],[48,7,48,12],[38,7,38,12],[13,0,13,12],[14,0,14,12],[16,7,16,12],[18,7,18,12],[30,9,30,10],[30,7,30,8],[16,0,16,3],[22,0,23,1],[17,0,17,1],[18,0,18,1],[19,0,19,1],[17,2,17,3],[18,2,18,3],[19,2,19,3],[20,2,20,3],[21,2,21,3],[20,0,20,1],[21,0,21,1],[22,2,23,3],[24,2,24,3],[34,0,34,1],[34,2,34,3],[31,2,31,3],[32,2,32,3],[28,2,28,3],[29,2,29,3],[30,2,30,3],[30,0,30,1],[32,0,33,1],[31,0,31,1],[27,2,27,3],[26,2,26,3],[24,0,24,1],[29,0,29,1],[27,0,28,1],[25,0,26,1],[44,2,44,3],[44,0,44,1],[25,2,25,3],[45,0,45,1],[37,2,41,3],[48,2,48,3],[35,2,35,3],[33,2,33,3],[35,0,35,1],[36,0,36,1],[37,0,43,1],[46,0,46,1],[36,2,36,3],[42,2,43,3],[45,2,45,3],[46,2,46,3],[49,0,50,1],[49,2,50,3],[47,2,47,3],[48,0,48,1],[47,0,47,1]]}
[]
[null,null,null,null,null,null,null,null,null," "," "," "]
[]
[]
[]
[null,null,null,null,null,null,null,null,null," "," "," "," "]
[]
[]
[]
[]
[]
[]
[]
["Cotización de Seguro Médico Internacional — SECURE CARE INTERNATIONAL"]
["ESTE PRODUCTO SOLO CUBRE GASTOS MEDICOS FUERA DE VENEZUELA"]
[]
["SECURE CARE INTERNATIONAL",null,null,null,null,null,null,{"$f":"+'INGRESO DE DATOS'!$D$11","v":"NOMBRE Y APELLIDO"}]
[]
[null,null,null,null,null,null,null,{"$f":"+'INGRESO DE DATOS'!$D$20","v":"AGENCIA"}]
[]
[null,null,null,null,null,null,null,null,null,{"$f":"+'INGRESO DE DATOS'!$G$13","v":2},null,null,{"$f":"+'INGRESO DE DATOS'!$G$15","v":54}]
[]
[null,null,null,null,null,null,null,null,null,{"$f":"+'INGRESO DE DATOS'!$J$13","v":3},null,null,{"$f":"+'INGRESO DE DATOS'!$J$15","v":54}]
[null,null,null,null,null,null,null,null,null," "," "," "]
[null,null,null,null,null,null,null,null,false,null,"COMPLICACIONES DE MATERNIDAD"]
[]
[null,null,null,null,null,null,null,null,false,null,"TRASPLANTE DE ORGANOS"]
[]
[null,null,null,null,null,null," "]
[]
[null,null,null,null,null,null,null,"FECHA DE COTIZACION :",null,{"$f":"NOW()","v":"2023-01-17T12:25:17.500"}]
[]
[]
[null,null,null,null,null,null,null,"Deducibles",null,"PLAN 1","PLAN 2","PLAN 3","PLAN 4"]
[null,null,null,null,null,null,null,"Dentro del pais de residencia",null,"n/a","n/a","n/a","n/a"]
[null,null,null,null,null,null,null,"Fuera del pais de residencia",null,2000,5000,10000,20000]
[]
[]
[null,null,null,null,null,null,null,"TARIFAS ANUALES"]
[null,null,null,null,null,null,null,"Prima de Titular :",null,{"$f":"VLOOKUP($M$21,Tablas!$A$408:$H$431,5,TRUE)","v":3217},{"$f":"VLOOKUP($M$21,Tablas!$A$408:$H$431,6,TRUE)","v":2287},{"$f":"VLOOKUP($M$21,Tablas!$A$408:$H$431,7,TRUE)","v":1978},{"$f":"VLOOKUP($M$21,Tablas!$A$408:$H$431,8,TRUE)","v":1481}]
{"$rows_left_out":23}
{"sheet":"Resumen-Tarifas-Anuales","index":4,"n_rows":39,"n_cols":8,"rows_kept":39,"cut":false,"hidden":false,"merged":[[38,0,40,7],[36,0,36,7],[22,0,22,1],[28,0,28,1],[27,0,27,1],[26,0,26,1],[30,0,30,1],[31,0,31,1],[32,0,32,1],[34,0,34,2],[26,2,26,5],[30,2,30,5],[14,2,14,7],[16,2,16,7],[20,0,20,1],[19,0,19,1],[12,0,12,7]]}
[]
[null,null,null,null," "," "," "]
[]
[]
[]
[null,null,null,null," "," "," "," "]
[]
[]
[]
[]
[]
[]
["Cotización de Seguro Médico Internacional"]
[]
[null,null,{"$f":"+'INGRESO DE DATOS'!$D$11","v":"NOMBRE Y APELLIDO"}]
[]
[null,null,{"$f":"+'INGRESO DE DATOS'!$D$20","v":"AGENCIA"}]
[]
[null,null,null,null,{"$f":"+'INGRESO DE DATOS'!$G$13","v":2},null,null,{"$f":"+'INGRESO DE DATOS'!$G$15","v":54}]
["FECHA DE COTIZACION :"]
[{"$f":"NOW()","v":"2023-01-17T12:25:17.500"},null,null,null,{"$f":"+'INGRESO DE DATOS'!$J$13","v":3},null,null,{"$f":"+'INGRESO DE DATOS'!$J$15","v":54}]
[null,null,null,null," "," "," "]
["DEDUCIBLES",null,"PLAN 1","PLAN 2","PLAN 3","PLAN 4"]
["Dentro del pais de residencia",null,"n/a","n/a","n/a","n/a"]
["Fuera del pais de residencia",null,2000,5000,10000,20000]
[]
["PRODUCTOS",null,"Tarifas Anuales"]
["Privilege Care International",null,{"$f":"+'Privilege-Care-International'!J40","v":14762},{"$f":"+'Privilege-Care-International'!K40","v":10514},{"$f":"+'Privilege-Care-International'!L40","v":8721},{"$f":"+'Privilege-Care-International'!M40","v":6645}]
["Secure Care International",null,{"$f":"+'Secure-Care-International'!J47","v":7938},{"$f":"+'Secure-Care-International'!K47","v":5666},{"$f":"+'Secure-Care-International'!L47","v":4908},{"$f":"+'Secure-Care-International'!M47","v":3684}]
[]
["PRODUCTOS",null,"Tarifas Semestrales*"]
["Privilege Care International",null,{"$f":"'Privilege-Care-International'!J50","v":7784.1100000000006},{"$f":"'Privilege-Care-International'!K50","v":5532.67},{"$f":"'Privilege-Care-International'!L50","v":4582.38},{"$f":"'Privilege-Care-International'!M50","v":3482.1000000000004}]
["Secure Care International",null,{"$f":"'Secure-Care-International'!J58","v":4167.3900000000003},{"$f":"'Secure-Care-International'!K58","v":2963.2300000000005},{"$f":"'Secure-Care-International'!L58","v":2561.4900000000002},{"$f":"'Secure-Care-International'!M58","v":1912.7700000000002}]
[]
["(*) USD 75 de costo administrativo annual aplica a la primera cuota"]
[]
["TARIFAS EN US$ — VÁLIDAS DESDE  01 ENERO DE 2023"]
[]
["Este presupuesto solamente tiene carácter informativo y en ningún momento expresa compromiso legal para suministrarle cobertura de seguro. La emisión de una póliza de seguro Bupa está sujeta a todas las evaluaciones de riesgo por parte de Bupa y a la recepción de todos los pagos de prima requeridos."]

{"sheet":"Tablas","index":5,"n_rows":474,"n_cols":12,"rows_kept":474,"cut":false,"hidden":true,"merged":[[1,0,1,7],[2,0,2,7],[36,0,36,1],[36,2,36,6],[35,0,35,7],[3,0,3,1],[3,2,3,6],[135,0,135,7],[69,0,69,7],[70,0,70,1],[70,2,70,6],[203,0,203,7],[136,0,136,7],[137,0,137,1],[137,2,137,6],[169,0,169,7],[170,0,170,1],[68,0,68,7],[102,0,102,7],[103,0,103,1],[103,2,103,6],[303,0,303,7],[269,0,269,7],[270,0,270,7],[271,0,271,1],[271,2,271,6],[170,2,170,6],[202,0,202,7],[236,0,236,7],[237,0,237,1],[237,2,237,6],[204,0,204,1],[204,2,204,6],[470,0,470,7],[403,0,403,7],[404,0,404,7],[405,0,405,1],[405,2,405,6],[304,2,304,6],[336,0,336,7],[437,0,437,7],[438,0,438,1],[438,2,438,6],[304,0,304,1],[370,0,370,7],[371,0,371,1],[371,2,371,6],[337,0,337,7],[338,0,338,1],[338,2,338,6],[539,0,539,1],[471,0,471,7],[472,0,472,1],[472,2,472,6],[504,0,504,7],[505,0,505,1],[505,2,505,6],[538,0,538,19],[537,0,537,19],[539,2,539,6],[540,14,540,16],[540,17,540,19],[547,14,547,16],[547,17,547,19],[545,0,545,19],[540,2,540,4],[547,2,547,4],[547,5,547,7],[547,8,547,10],[546,0,546,1],[546,2,546,6],[540,5,540,7],[540,8,540,10],[547,11,547,13],[540,11,540,13]]}
[]
["EXCLUSIVE",null,null,null,null,null,null,null,null,"FACTOR SEMESTRAL :",null,0.53]
["TARIFAS ANUALES"]
["EDAD"]
[" "," ",null,"DW2","DW3","DW4","DW5","DW6"]
[]
[]
[]
[]
[]
[]
[]
[]
[]
[]
[]
[]
[]
[]
[]
[]
[]
[]
[]
[]
[]
[]
[]
[]
[]
[]
[]
[]
[]
[]
[]
[]
[]
[]
[]
{"$rows_left_out":434}