{"text_format":"1","workbook":"xlsx","n_sheets":8,"sheets":["INGRESO DE DATOS","Essential Care (Renovación)","Essential 500","Essential 1000","Resumen Tarifas","Tablas","Tablas Guyanas y Santa Elena","Tablas Resto de Ecuador"],"not_rendered":{"charts":0,"images":8,"macros":1,"external_links":0,"defined_names":5,"comments":1,"pivot_tables":0},"unopened":[],"bounds":{"document_bytes":16777216,"sheet_cells":100000,"rows_first":2000,"rows_last":500,"rows_between":2000,"halvings":0,"cell_chars":16384,"cell_head_chars":4096},"cells_cut":0,"cells_raw":0,"read":"whole","date_system":"1900"}

{"sheet":"INGRESO DE DATOS","index":0,"n_rows":65,"n_cols":27,"rows_kept":65,"cut":false,"hidden":false,"merged":[[55,3,55,4],[55,6,55,7],[10,0,10,12],[44,0,44,1],[36,0,36,1],[38,0,38,1],[40,0,40,1],[42,0,42,1],[14,10,14,12],[48,0,48,2],[25,20,25,24],[21,20,21,24],[43,11,46,12],[10,14,10,16],[36,2,36,12],[21,14,21,18],[36,14,36,18],[44,14,44,18],[10,18,17,18],[41,14,41,16],[10,21,17,21],[41,20,41,24],[42,11,42,12],[61,17,63,18],[64,17,64,18],[29,20,29,24],[33,20,33,24],[37,20,37,24],[56,17,58,18],[59,17,59,18],[45,20,45,24],[49,20,49,24],[53,20,53,24]]}
[]
[null,null,null,null,null,null,null," "," ",null,null,null,null,null,"24 years",false]
[null,null,null,null,null,null,null,null,null,null,null,null,null,null,"Coaseguro (Panamá)",false]
[]
[]
[null,null,null,null,null,null,null," "," "]
[]
[]
[]
[]
[null,null,null,null,null,null,null,null,null,null,null,null,null,null,"Descuento 24 años (por edad)",null,null,null,"Type","Nuevo Negocio",null,"Zonas","Guayas/Santa Elena"]
[null,null,null,null,null,null,null,null,null,null,null,null,null,null,"age","Discount (%)","Parameter",null,null,"Pólizas 2020",null,null,"El Resto de Ecuador"]
[null,null,null,null,null,null,null,null,null,null,null,null,null,null,24,35,{"$f":"1-P13/100","v":0.65},null,null,"Pólizas 2021"]
[null,null,null,null,null,null,null,null,null,null,null,null,null,null,25,30,{"$f":"1-P14/100","v":0.7},null,null,"Pólizas Mayo - Agosto 2023"]
[null,null,null,null,null,null,null,null,null,null,null,null,null,null,26,25,0.75,null,null,"Renovaciones"]
[null,null,null,null,null,null,null,null,null,null,null,null,null,null,27,20,0.8,null,null,"Renovación: Pólizas mayo - diciembre de 2024"]
[null,null,null,null,null,null,null,null,null,null,null,null,null,null,28,15,0.85,null,null,"Renovación: Pólizas febrero a abril 2024"]
[null,null,null,null,null,null,null,null,null,null,null,null,null,null,29,6,0.94,null,null,"Renovación: Pólizas enero - julio 2025"]
[null,null,null,null,null,null,null,null,null,null,null,null,null,null,"All ages",0,1,null,"Type selected",1,null,"Zona seleccionada",1]
[null,null,null,null,null,null,null,null,null,null,null,null,null,null,null,null,null,null,null,null,null,"Nombre de la Zona",{"$f":"IF(W19=1,\"Guayas/Santa Elena\",\"Resto de Ecuador\")","v":"Guayas/Santa Elena"}]
[null,null,null,null,null,null,null,false]
[null,null,null,null,null,null,null,null,null,null,null,null,null,null,"1. NEW BUSINESS DISCOUNT",null,null,null,null,null,"2. PÓLIZAS 2020"]
[null,null,null,null,null,null,null,null,null,null,null,null,null,null,"Essential","Essential 1000","Essential 500",null,null,null,"Essential","Essential 1000","Essential 500"]
[null,null,null,null,null,null,null,null,null,null,null,null,null,null,15,0,0,null,null,null,15,0,0]
[]
[null,null,null,null,null,null,null,null,null,null,null,null,null,null,null,null,null,null,null,null,"3. PÓLIZAS 2021"]
[null,null,null,null,null,null,null,null,null,null,null,null,null,null,null,null,null,null,null,null,"Essential","Essential 1000","Essential 500"]
[null,null,null,null,null,null,null,null,null,null,null,null,null,null,null,null,null,null,null,null,15,0,0]
[]
[null,null,null,null,null,null,null,null,null,null,null,null,null,null,"Des 24 años:",{"$f":"IF(P2,IF(C43=O13,Q13,IF(C43=O14,Q14,IF(C43=O15,Q15,IF(C43=O16,Q16,IF(C43=O17,Q17,IF(C43=O18,Q18,Q19)))))),Q19)","v":1},null,null,null,null,"4. PÓLIZAS 2022"]
[null,null,null,null,null,null,null,null,null,null,null,null,null,null,null,null,null,null,null,null,"Essential","Essential 1000","Essential 500"]
[null,null,null,null,null,null,null,null,null,null,null,null,null,null,"Des var coaseguro:",{"$f":"IF(P3=TRUE,0.25,1)","v":1},null,null,null,null,0,0,0]
[]
[null,null,null,null,null,null,null,null,null,null,null,null,null,null,null,null,null,null,null,null,"5. PÓLIZAS 2023"]
[null,null,null,null,null,null,null,null,null,null,null,null,null,null,"Descuento si es nuevo negocio:",null,null,null,null,null,"Essential","Essential 1000","Essential 500"]
[null,null,null,null,null,null,null,null,null,null,null,null,null,null,null,null,null,null,null,null,0,0,0]
["Nombre del Asegurado Titular:",null,"John Doe",null,null,null,null,null,null,null,null,null,null,null,"NEW BUSINESS DISCOUNT (MULTIPLICATION FACTOR)"]
[null,null,null,null,null,null,null,null,null,null,null,null,null,null,"Essential","Essential 1000","Essential 500",null,null,null,"6. PÓLIZAS MAYO - AGOSTO 2023"]
["Número de adultos en la póliza:",null,2,null,null,null,null,null,null,null,null,null,null,null,{"$f":"IF($T$19=1, (O24/100),IF($T$19=2, (U24/100), IF($T$19=3,(U28/100),IF($T$19=4,(U40/100),IF($T$19=5,0,IF($T$19=7,U52/100,0))))))","v":0.15},{"$f":"IF($T$19=1, (P24/100),IF($T$19=2, (V24/100), IF($T$19=3,(V28/100),IF($T$19=4,(V40/100),IF($T$19=5,0,IF($T$19=7,V52/100,0))))))","v":0},0,null,null,null,"Essential","Essential 1000","Essential 500"]
[null,null,null,null,null,null,null,null,null,null,null,null,null,null,null,null,null,null,null,null,5,5,0]
["Número total de dependientes:",null,1]
[null,null,null,null,null,null,null,null,null,null,null,null,null,null,"Descuento combinado 24 años y Nuevo Negocio",null,null,null,null,null,"7. RENOVACIONES"]
["Edad del Asegurado Titular:",null,34,null,null,null,null,null,null,null,null,{"$f":"IF(T19=1,\"Solo Essential 500 y 1000\",\"\")","v":"Solo Essential 500 y 1000"},null,null,null,null,null,null,null,null,"Essential","Essential 1000","Essential 500"]
[null,null,null,null,null,null,null,null,null,null,null,{"$f":"IF($T$19=1,\"Para nuevos negocios emitidos a partir del 1 de enero de  2025\",IF($T$19=2,\"Para renovaciones de pólizas vendidas entre el 1ro de enero y el 31 de diciembre de 2020\",IF($T$19=3,\"Para renovaciones de pólizas vendidas entre el 1ro de enero y el 31 de diciembre de 2021\",IF($T$19=4,\"Para renovaciones de pólizas vendidas entre el 1ro de mayo y el 31 de agosto de 2023\", \"\"))))","v":"Para nuevos negocios emitidos a partir del 1 de enero de  2025"},null,null,null,null,null,null,null,null,0,0,0]
["Edad del/la cónyuge:",null,32,null,null,null,null,null,null,null,null,null,null,null,"NEW BUSINESS DISCOUNT"]
[null,null,null,null,null,null,null,null,null,null,null,null,null,null,"Essential","Essential 1000","Essential 500",null,null,null,"8. RENOCACIONES Pólizas mayo - diciembre 2024 Essential 1000"]
[null,null,null,null,null,null,null,null,null,null,null,null,null,null,{"$f":"(1-O39)*$P$30","v":0.85},{"$f":"(1-P39)*$P$30","v":1},{"$f":"(1-Q39)*$P$30","v":1},null,null,null,250,500,1000,2000,5000,10000,20000]
[null,null,null,null,null,null,null,null,null,null,null,null,null,null,null,null,null,null,null,null,7.0000000000000007E-2,7.0000000000000007E-2,7.0000000000000007E-2,7.0000000000000007E-2,7.0000000000000007E-2,0,0]
["Tarifas en US$ | Validas: 1 de enero de 2025"]
[null,null,null,null,null,null,null,null,null,null,null,null,null,null,null,null,null,null,null,null,"9. PÓLIZAS FEBRERO A ABRIL 2024"]
[null,null,null,null,null,null,null,null,null,null,null,null,null,null,null,null,null,null,null,null,"Essential","Essential 1000","Essential 500"]
[null,null,null,null,null,null,null,null,null,null,null,null,null,null,null,null,null,null,null,null,0,5,0]
[]
[null,null,null,null,null,null,null,null,null,null,null,null,null,null,null,null,null,null,null,null,"10. RENOCACIONES Pólizas enero - julio 2025 Essential 1000"]
[null,null,null,null,null,null,null,null,null,null,null,null,null,null,null,null,null,null,null,null,250,500,1000,2000,5000,10000,20000]
[null,null,null,null,null,null,null,null,null,null,null,null,null,null,null,null,null,null,null,null,7.0000000000000007E-2,7.0000000000000007E-2,7.0000000000000007E-2,7.0000000000000007E-2,7.0000000000000007E-2,0,0]
[null,null,null,null,null,null,null,null,null,null,null,null,null,null,null,null,null,"Número de dependientes\nmenores de 16 años:"]
[]
[]
[null,null,null,null,null,null,null,null,null,null,null,null,null,null,null,null,null,0]
[]
[null,null,null,null,null,null,null,null,null,null,null,null,null,null,null,null,null,"Número de dependientes\nmenores de 10 años:"]
[]
[]
[null,null,null,null,null,null,null,null,null,null,null,null,null,null,null,null,null,0]

{"sheet":"Essential Care (Renovación)","index":1,"n_rows":83,"n_cols":9,"rows_kept":83,"cut":false,"hidden":false,"merged":[[14,1,14,6],[0,8,0,19],[4,0,10,5],[4,6,5,6],[6,6,10,6],[12,1,12,6],[81,0,81,6],[82,0,86,6],[16,3,16,5],[18,3,18,5],[20,3,21,4],[20,5,21,6],[29,0,29,6],[41,0,41,6],[17,3,17,4],[55,0,55,6],[69,0,69,6]]}
[null,true,true,null,null,null,null,null,"RESUMEN DE BENEFICIOS"]
[null,null,null," "," "," "]
[]
[]
["Cotización de Seguro Médico Internacional\nBupa Essential Care\nTarifas en US$ | Validas: 1 de enero de 2025",null,null,null,null,null,"REGIÓN"]
[]
[null,null,null,null,null,null,{"$f":"'INGRESO DE DATOS'!W20","v":"Guayas/Santa Elena"}]
[]
[]
[]
[]
[]
["Nombre del asegurado principal",{"$f":"+'INGRESO DE DATOS'!$C$37","v":"John Doe"}]
[]
["Broker/Agente",{"$f":"+'INGRESO DE DATOS'!$C$44","v":0}]
[]
["Número de Adultos en la Póliza",{"$f":"+'INGRESO DE DATOS'!$C$39","v":2},null,"Dependientes (menores de 24 años)",null,null,{"$f":"+'INGRESO DE DATOS'!$C$41","v":1}]
[null,null,null,{"$f":"IF('INGRESO DE DATOS'!$P$2=TRUE, \"Cotización para dependiente de 24 años\",\"\")","v":""}]
["Edad del Titular",{"$f":"+'INGRESO DE DATOS'!$C$43","v":34},null,"Edad del Cónyuge",null,null,{"$f":"+'INGRESO DE DATOS'!$C$45","v":32}]
[]
[null,null,null,"Fecha de Cotización:",null,{"$f":"NOW()","v":"2026-01-06T09:23:13.540"}]
[]
[]
[]
["DEDUCIBLES","PLAN 1","PLAN 2","PLAN 3","PLAN 4","PLAN 5","PLAN 6"]
["Dentro del pais de residencia",0,1000,2000,5000,10000,20000]
["Fuera del pais de residencia",1000,2000,3000,5000,10000,20000]
[]
[]
["TARIFAS ANUALES"]
["Prima de Titular",{"$f":"VLOOKUP($B$19,Tablas!$A$159:$I$182,3,TRUE)+75","v":6007},{"$f":"VLOOKUP($B$19,Tablas!$A$159:$I$182,4,TRUE)+75","v":5513.15},{"$f":"VLOOKUP($B$19,Tablas!$A$159:$I$182,5,TRUE)+75","v":5208.8499999999995},{"$f":"VLOOKUP($B$19,Tablas!$A$159:$I$182,6,TRUE)+75","v":3743.45},{"$f":"VLOOKUP($B$19,Tablas!$A$159:$I$182,7,TRUE)+75","v":2956.35},{"$f":"VLOOKUP($B$19,Tablas!$A$159:$I$182,8,TRUE)+75","v":2272.9499999999998}]
["Prima de Cónyuge",{"$f":"IF($B$17=1,0,(VLOOKUP($G$19,Tablas!$A$159:$I$182,3,TRUE)))","v":5932},{"$f":"IF($B$17=1,0,(VLOOKUP($G$19,Tablas!$A$159:$I$182,4,TRUE)))","v":5438.15},{"$f":"IF($B$17=1,0,(VLOOKUP($G$19,Tablas!$A$159:$I$182,5,TRUE)))","v":5133.8499999999995},{"$f":"IF($B$17=1,0,(VLOOKUP($G$19,Tablas!$A$159:$I$182,6,TRUE)))","v":3668.45},{"$f":"IF($B$17=1,0,(VLOOKUP($G$19,Tablas!$A$159:$I$182,7,TRUE)))","v":2881.35},{"$f":"IF($B$17=1,0,(VLOOKUP($G$19,Tablas!$A$159:$I$182,8,TRUE)))","v":2197.9499999999998}]
["Primas Hijos",{"$f":"IF($G$17=0,0,(VLOOKUP($G$17,Tablas!$A$183:$I$185,3,TRUE)))","v":1386.35},{"$f":"IF($G$17=0,0,(VLOOKUP($G$17,Tablas!$A$183:$I$185,4,TRUE)))","v":1295.3999999999999},{"$f":"IF($G$17=0,0,(VLOOKUP($G$17,Tablas!$A$183:$I$185,5,TRUE)))","v":1289.45},{"$f":"IF($G$17=0,0,(VLOOKUP($G$17,Tablas!$A$183:$I$185,6,TRUE)))","v":1127.0999999999999},{"$f":"IF($G$17=0,0,(VLOOKUP($G$17,Tablas!$A$183:$I$185,7,TRUE)))","v":877.19999999999993},{"$f":"IF($G$17=0,0,(VLOOKUP($G$17,Tablas!$A$183:$I$185,8,TRUE)))","v":648.54999999999995}]
["Rider: Complicaciones de  Maternidad",{"$f":"+IF($B$1=FALSE,0,Tablas!C186)","v":225},{"$f":"+IF($B$1=FALSE,0,Tablas!D186)","v":225},{"$f":"+IF($B$1=FALSE,0,Tablas!E186)","v":225},{"$f":"+IF($B$1=FALSE,0,Tablas!F186)","v":225},{"$f":"+IF($B$1=FALSE,0,Tablas!G186)","v":225},{"$f":"+IF($B$1=FALSE,0,Tablas!H186)","v":225}]
["Rider: Trasplante Organos",{"$f":"+IF($C$1=FALSE,0,Tablas!C187)","v":300},{"$f":"+IF($C$1=FALSE,0,Tablas!D187)","v":300},{"$f":"+IF($C$1=FALSE,0,Tablas!E187)","v":300},{"$f":"+IF($C$1=FALSE,0,Tablas!F187)","v":300},{"$f":"+IF($C$1=FALSE,0,Tablas!G187)","v":300},{"$f":"+IF($C$1=FALSE,0,Tablas!H187)","v":300}]
["TOTAL PRIMA NETA",{"$f":"SUM(B31:B35)","v":13850.35},{"$f":"SUM(C31:C35)","v":12771.699999999999},12157.15,9064,7239.9,5644.45]
["Contrib. 3.5% Super. Bancos :",{"$f":"B36*3.5%","v":484.76225000000005},{"$f":"C36*3.5%","v":447.0095},425.50025000000005,317.24,253.3965,197.55575000000002]
["Contrib 0.5% Seg.Soc.Campes:",{"$f":"B36*0.5%","v":69.251750000000001},{"$f":"C36*0.5%","v":63.858499999999999},60.78575,45.32,36.1995,28.222249999999999]
["GRAN TOTAL :",{"$f":"SUM(B36:B38)","v":14404.364},{"$f":"SUM(C36:C38)","v":13282.567999999999},12643.435999999998,9426.56,7529.4959999999992,{"$f":"SUM(G36:G38)","v":5870.2280000000001}]
[]
[]
["TARIFAS SEMESTRALES"]
["Prima de Titular",{"$f":"($B$31-75)*Tablas!$M$5+75","v":3218.96},{"$f":"($C$31-75)*Tablas!$M$5+75","v":2957.2195000000002},{"$f":"($D$31-75)*Tablas!$M$5+75","v":2795.9404999999997},{"$f":"($E$31-75)*Tablas!$M$5+75","v":2019.2784999999999},{"$f":"($F$31-75)*Tablas!$M$5+75","v":1602.1155000000001},{"$f":"($G$31-75)*Tablas!$M$5+75","v":1239.9134999999999}]
["Prima de Cónyuge",{"$f":"IF($B$17=1,0,$B$32*Tablas!$M$5)","v":3143.96},{"$f":"IF($B$17=1,0,$C$32*Tablas!$M$5)","v":2882.2195000000002},{"$f":"IF($B$17=1,0,$D$32*Tablas!$M$5)","v":2720.9404999999997},{"$f":"IF($B$17=1,0,$E$32*Tablas!$M$5)","v":1944.2784999999999},{"$f":"IF($B$17=1,0,$F$32*Tablas!$M$5)","v":1527.1155000000001},{"$f":"IF($B$17=1,0,$G$32*Tablas!$M$5)","v":1164.9134999999999}]
["Primas Hijos",{"$f":"IF($G$17=0,0,$B$33*Tablas!$M$5)","v":734.76549999999997},{"$f":"IF($G$17=0,0,$C$33*Tablas!$M$5)","v":686.56200000000001},{"$f":"IF($G$17=0,0,$D$33*Tablas!$M$5)","v":683.4085},{"$f":"IF($G$17=0,0,$E$33*Tablas!$M$5)","v":597.36299999999994},{"$f":"IF($G$17=0,0,$F$33*Tablas!$M$5)","v":464.916},{"$f":"IF($G$17=0,0,$G$33*Tablas!$M$5)","v":343.73149999999998}]
["Rider: Complicaciones de  Maternidad",{"$f":"+IF($B$1=FALSE,0,$B$34*Tablas!$M$5)","v":119.25},{"$f":"+IF($B$1=FALSE,0,$C$34*Tablas!$M$5)","v":119.25},{"$f":"+IF($B$1=FALSE,0,$D$34*Tablas!$M$5)","v":119.25},{"$f":"+IF($B$1=FALSE,0,$E$34*Tablas!$M$5)","v":119.25},{"$f":"+IF($B$1=FALSE,0,$F$34*Tablas!$M$5)","v":119.25},{"$f":"+IF($B$1=FALSE,0,$G$34*Tablas!$M$5)","v":119.25}]
["Rider: Trasplante Organos",{"$f":"+IF($C$1=FALSE,0,$B$35*Tablas!$M$5)","v":159},{"$f":"+IF($C$1=FALSE,0,$C$35*Tablas!$M$5)","v":159},{"$f":"+IF($C$1=FALSE,0,$D$35*Tablas!$M$5)","v":159},{"$f":"+IF($C$1=FALSE,0,$E$35*Tablas!$M$5)","v":159},{"$f":"+IF($C$1=FALSE,0,$F$35*Tablas!$M$5)","v":159},{"$f":"+IF($C$1=FALSE,0,$G$35*Tablas!$M$5)","v":159}]
["TOTAL PRIMA NETA",{"$f":"SUM(B43:B47)","v":7375.9354999999996},{"$f":"SUM(C43:C47)","v":6804.2510000000002},6478.539499999999,4839.17,3872.3970000000004,3026.8084999999996]
["Contrib. 3.5% Super. Bancos :",{"$f":"B48*3.5%","v":258.15774249999998},{"$f":"C48*3.5%","v":238.14878500000003},226.74888249999998,169.37095000000002,135.53389500000003,105.9382975]
["Contrib 0.5% Seg.Soc.Campes:",{"$f":"B48*0.5%","v":36.8796775},{"$f":"C48*0.5%","v":34.021255000000004},32.392697499999997,24.19585,19.361985000000001,15.134042499999998]
["TOTAL de primera cuota",{"$f":"SUM(B48:B50)","v":7670.9729199999992},{"$f":"SUM(C48:C50)","v":7076.4210400000002},6737.6810799999994,5032.7368000000006,4027.2928800000004,{"$f":"SUM(G48:G50)","v":3147.8808399999994}]
["Costo de segunda cuota",{"$f":"(B48+B49+B50)*1-78","v":7592.9729199999992},{"$f":"(C48+C49+C50)*1-78","v":6998.4210400000002},6659.6810799999994,4954.7368000000006,3949.2928800000004,{"$f":"(G48+G49+G50)*1-78","v":3069.8808399999994}]
["GRAN TOTAL",{"$f":"SUM(B51:B52)","v":15263.945839999998},{"$f":"SUM(C51:C52)","v":14074.84208},13397.362159999999,9987.4736000000012,7976.5857600000008,6217.7616799999987]
[]
[]
["TARIFAS TRIMESTRALES"]
["Prima de Titular",{"$f":"($B$31-75)*Tablas!$M$6+75","v":1706.3000000000002},{"$f":"($C$31-75)*Tablas!$M$6+75","v":1570.49125},{"$f":"($D$31-75)*Tablas!$M$6+75","v":1486.8087499999999},{"$f":"($E$31-75)*Tablas!$M$6+75","v":1083.82375},{"$f":"($F$31-75)*Tablas!$M$6+75","v":867.37125000000003},{"$f":"($G$31-75)*Tablas!$M$6+75","v":679.43624999999997}]
["Prima de Cónyuge",{"$f":"IF($B$17=1,0,$B$32*Tablas!$M$6)","v":1631.3000000000002},{"$f":"IF($B$17=1,0,$C$32*Tablas!$M$9)","v":13513802.75},{"$f":"IF($B$17=1,0,$D$32*Tablas!$M$6)","v":1411.8087499999999},{"$f":"IF($B$17=1,0,$E$32*Tablas!$M$6)","v":1008.82375},{"$f":"IF($B$17=1,0,$F$32*Tablas!$M$6)","v":792.37125000000003},{"$f":"IF($B$17=1,0,$G$32*Tablas!$M$6)","v":604.43624999999997}]
["Primas Hijos",{"$f":"IF($G$17=0,0,$B$33*Tablas!$M$6)","v":381.24625000000003},{"$f":"IF($G$17=0,0,$C$33*Tablas!$M$6)","v":356.23500000000001},{"$f":"IF($G$17=0,0,$D$33*Tablas!$M$6)","v":354.59875000000005},{"$f":"IF($G$17=0,0,$E$33*Tablas!$M$6)","v":309.95249999999999},{"$f":"IF($G$17=0,0,$F$33*Tablas!$M$6)","v":241.23},{"$f":"IF($G$17=0,0,$G$33*Tablas!$M$6)","v":178.35124999999999}]
["Rider: Complicaciones de  Maternidad",{"$f":"+IF($B$1=FALSE,0,$B$34*Tablas!$M$6)","v":61.875000000000007},{"$f":"+IF($B$1=FALSE,0,$C$34*Tablas!$M$6)","v":61.875000000000007},{"$f":"+IF($B$1=FALSE,0,$D$34*Tablas!$M$6)","v":61.875000000000007},{"$f":"+IF($B$1=FALSE,0,$E$34*Tablas!$M$6)","v":61.875000000000007},{"$f":"+IF($B$1=FALSE,0,$F$34*Tablas!$M$6)","v":61.875000000000007},{"$f":"+IF($B$1=FALSE,0,$G$34*Tablas!$M$6)","v":61.875000000000007}]
["Rider: Trasplante Organos",{"$f":"+IF($C$1=FALSE,0,$B$35*Tablas!$M$6)","v":82.5},{"$f":"+IF($C$1=FALSE,0,$C$35*Tablas!$M$6)","v":82.5},{"$f":"+IF($C$1=FALSE,0,$D$35*Tablas!$M$6)","v":82.5},{"$f":"+IF($C$1=FALSE,0,$E$35*Tablas!$M$6)","v":82.5},{"$f":"+IF($C$1=FALSE,0,$F$35*Tablas!$M$6)","v":82.5},{"$f":"+IF($C$1=FALSE,0,$G$35*Tablas!$M$6)","v":82.5}]
["TOTAL PRIMA NETA",{"$f":"SUM(B57:B61)","v":3863.2212500000005},{"$f":"SUM(C57:C61)","v":13515873.85125},3397.5912499999999,2546.9749999999999,2045.3475000000001,1606.5987499999999]
["Contrib. 3.5% Super. Bancos :",{"$f":"B62*3.5%","v":135.21274375000004},{"$f":"C62*3.5%","v":473055.58479375008},118.91569375,89.144125000000003,71.587162500000005,56.230956249999998]
["Contrib 0.5% Seg.Soc.Campes:",{"$f":"B62*0.5%","v":19.316106250000004},{"$f":"C62*0.5%","v":67579.369256250007},16.98795625,12.734875000000001,10.2267375,8.0329937499999993]
["TOTAL de primera cuota",{"$f":"SUM(B62:B64)","v":4017.7501000000002},{"$f":"SUM(C62:C64)","v":14056508.805300001},3533.4949000000001,2648.8539999999998,2127.1614000000004,{"$f":"SUM(G62:G64)","v":1670.8626999999999}]
["Costo de tarifa trimestral 2 a 4",{"$f":"(B62+B63+B64)*1-78","v":3939.7501000000002},{"$f":"(C62+C63+C64)*1-78","v":14056430.805300001},3455.4949000000001,2570.8539999999998,2049.1614000000004,{"$f":"(G62+G63+G64)*1-78","v":1592.8626999999999}]
["GRAN TOTAL",{"$f":"B65+B66*3","v":15837.000400000001},{"$f":"C65+C66*3","v":56225801.221200004},13899.979600000001,10361.415999999999,8274.6456000000017,6449.4507999999996]
[]
[]
["TARIFAS MENSUALES"]
["Prima de Titular",{"$f":"($B$31-75)*Tablas!$M$7+75","v":628.63355999999999},{"$f":"($C$31-75)*Tablas!$M$7+75","v":582.54253949999998},{"$f":"($D$31-75)*Tablas!$M$7+75","v":554.14222049999989},{"$f":"($E$31-75)*Tablas!$M$7+75","v":417.37643849999995},{"$f":"($F$31-75)*Tablas!$M$7+75","v":343.91639549999996},{"$f":"($G$31-75)*Tablas!$M$7+75","v":280.13467349999996}]
["Prima de Cónyuge",{"$f":"IF($B$17=1,0,$B$32*Tablas!$M$7)","v":553.63355999999999},{"$f":"IF($B$17=1,0,$C$32*Tablas!$M$7)","v":507.54253949999992},{"$f":"IF($B$17=1,0,$D$32*Tablas!$M$7)","v":479.14222049999995},{"$f":"IF($B$17=1,0,$E$32*Tablas!$M$7)","v":342.37643849999995},{"$f":"IF($B$17=1,0,$F$32*Tablas!$M$7)","v":268.91639549999996},{"$f":"IF($B$17=1,0,$G$32*Tablas!$M$7)","v":205.13467349999996}]
["Primas Hijos",{"$f":"IF($G$17=0,0,$B$33*Tablas!$M$7)","v":129.38804549999998},{"$f":"IF($G$17=0,0,$C$33*Tablas!$M$7)","v":120.89968199999998},{"$f":"IF($G$17=0,0,$D$33*Tablas!$M$7)","v":120.3443685},{"$f":"IF($G$17=0,0,$E$33*Tablas!$M$7)","v":105.19224299999999},{"$f":"IF($G$17=0,0,$F$33*Tablas!$M$7)","v":81.869075999999993},{"$f":"IF($G$17=0,0,$G$33*Tablas!$M$7)","v":60.529171499999997}]
["Rider: Complicaciones de  Maternidad",{"$f":"+IF($B$1=FALSE,0,$B$34*Tablas!$M$7)","v":20.99925},{"$f":"+IF($B$1=FALSE,0,$C$34*Tablas!$M$7)","v":20.99925},{"$f":"+IF($B$1=FALSE,0,$D$34*Tablas!$M$7)","v":20.99925},{"$f":"+IF($B$1=FALSE,0,$E$34*Tablas!$M$7)","v":20.99925},{"$f":"+IF($B$1=FALSE,0,$F$34*Tablas!$M$7)","v":20.99925},{"$f":"+IF($B$1=FALSE,0,$G$34*Tablas!$M$7)","v":20.99925}]
["Rider: Trasplante Organos",{"$f":"+IF($C$1=FALSE,0,$B$35*Tablas!$M$7)","v":27.998999999999999},{"$f":"+IF($C$1=FALSE,0,$C$35*Tablas!$M$7)","v":27.998999999999999},{"$f":"+IF($C$1=FALSE,0,$D$35*Tablas!$M$7)","v":27.998999999999999},{"$f":"+IF($C$1=FALSE,0,$E$35*Tablas!$M$7)","v":27.998999999999999},{"$f":"+IF($C$1=FALSE,0,$F$35*Tablas!$M$7)","v":27.998999999999999},{"$f":"+IF($C$1=FALSE,0,$G$35*Tablas!$M$7)","v":27.998999999999999}]
["TOTAL PRIMA NETA",{"$f":"SUM(B71:B75)","v":1360.6534154999999},{"$f":"SUM(C71:C75)","v":1259.983011},1202.6270594999999,{"$f":"SUM(E71:E75)","v":913.94336999999985},743.70011699999986,594.79676849999987]
["Contrib. 3.5% Super. Bancos :",{"$f":"B76*3.5%","v":47.622869542500005},{"$f":"C76*3.5%","v":44.099405385000004},42.091947082499999,31.988017949999996,26.029504094999997,20.817886897499996]
["Contrib 0.5% Seg.Soc.Campes:",{"$f":"B76*0.5%","v":6.8032670775000001},{"$f":"C76*0.5%","v":6.2999150550000005},6.0131352974999999,4.5697168499999989,3.7185005849999992,{"$f":"G76*0.5%","v":2.9739838424999996}]
["TOTAL de primera cuota",{"$f":"SUM(B76:B78)","v":1415.07955212},{"$f":"SUM(C76:C78)","v":1310.3823314399999},1250.7321418799997,950.50110479999978,773.44812167999987,{"$f":"SUM(G76:G78)","v":618.58863923999991}]
["Costo de Tarifa mensual de 2 a 12",{"$f":"(B76+B77+B78)*1-78","v":1337.07955212},{"$f":"(C76+C77+C78)*1-78","v":1232.3823314399999},1172.7321418799997,872.50110479999978,695.44812167999987,{"$f":"(G76+G77+G78)*1-78","v":540.58863923999991}]
["GRAN TOTAL",{"$f":"B79+B80*11","v":16122.954625439999},{"$f":"C79+C80*11","v":14866.587977279998},14150.785702559997,10548.013257599998,8423.377460159998,6565.0636708799984]
[]
["Este presupuesto solamente tiene carácter informativo y en ningún momento expresa compromiso legal para suministrarle cobertura de seguro. La emisión de una póliza de seguro Bupa está sujeta a todas las evaluaciones de riesgo por parte de Bupa y a la recepción de todos los pagos de prima requeridos."]

{"sheet":"Essential 500","index":2,"n_rows":79,"n_cols":32,"rows_kept":79,"cut":false,"hidden":false,"merged":[[0,11,0,24],[0,26,0,39],[73,0,73,1],[22,0,22,2],[39,0,39,8],[40,0,40,1],[41,0,41,1],[42,0,42,1],[45,0,45,1],[30,0,30,1],[31,0,31,1],[34,0,34,1],[35,0,35,1],[36,0,36,1],[0,0,3,8],[44,0,44,1],[78,0,81,8],[65,0,65,8],[66,0,66,1],[67,0,67,1],[68,0,68,1],[72,0,72,1],[69,0,69,1],[71,0,71,1],[70,0,70,1],[58,0,58,1],[46,0,46,1],[47,0,47,1],[52,0,52,8],[53,0,53,1],[54,0,54,1],[55,0,55,1],[59,0,59,1],[4,8,5,8],[6,8,10,8],[4,0,10,7],[60,0,60,1],[33,0,33,1],[20,1,20,2],[25,0,25,1],[26,0,26,1],[28,0,28,8],[29,0,29,1],[12,1,12,8],[18,6,18,7],[57,0,57,1],[16,2,16,3],[56,0,56,1]]}
[" ",null,null,null,null,null,null,null,null,null,null,"RESUMEN DE BENEFICIOS",null,null,null,null,null,null,null,null,null,null,null,null,null,null,"RESUMEN DE BENEFICIOS"]
[]
[null,null,null,null,null,null,null,null,null,null,null,null,null,null," "," "," ",null,null,null,null,null,null,null,null,null,null,null,null," "," "," "]
[]
["Cotización de Seguro Médico\nBupa Essential 500\nTarifas en US$ | Validas: 1 de enero de 2025",null,null,null,null,null,null,null,"REGIÓN"]
[]
[null,null,null,null,null,null,null,null,{"$f":"'INGRESO DE DATOS'!W20","v":"Guayas/Santa Elena"},null,null,null,null,null," "," "," ",null,null,null,null,null,null,null,null,null,null,null,null," "," "," "]
[]
[]
[]
[]
[]
["Nombre del Asegurado Titular",{"$f":"+'INGRESO DE DATOS'!$C$37","v":"John Doe"}]
[]
["Número de adultos en la póliza",{"$f":"+'INGRESO DE DATOS'!$C$39","v":2}]
[]
["Número de Dependientes en la póliza",{"$f":"+'INGRESO DE DATOS'!$C$41","v":1},{"$f":"IF('INGRESO DE DATOS'!$P$2=TRUE, \"Cotización para dependiente de 24 años\",\"\")","v":""}]
[]
["Edad del Asegurado Titular",{"$f":"+'INGRESO DE DATOS'!$C$43","v":34},null,null,null,null,"Edad del/la conyuge",null,{"$f":"+'INGRESO DE DATOS'!$C$45","v":32},null,null,null," "," ",null,null,null,null,null,null,null,null,null,null,null,null,null," "," "]
[]
["Fecha de la cotización",{"$f":"NOW()","v":"2026-01-06T09:23:13.540"},null,null,null,null,null,null,null,null,null," ",false,null," ",null,null,null,null,null,null,null,null,null,null,null," ",false,null," "]
[]
[{"$f":"IF('INGRESO DE DATOS'!P3=TRUE,\"Variante con coaseguro fuera del país de residencia: SI\",\"Variante con coaseguro fuera del país de residencia: NO\")","v":"Variante con coaseguro fuera del país de residencia: NO"}]
[null,null," ",null,null,null,null,null," "]
["Deducibles",null,"PLAN 1","PLAN 2","PLAN 3","PLAN 4","PLAN 5","PLAN 6","PLAN 7"]
["En el país de residencia",null,250,500,1000,2000,5000,10000,20000]
["Fuera del país de residencia",null,500,1000,2000,4000,5000,10000,20000]
[]
["TARIFAS ANUALES"]
["Prima para Asegurado Titular",null,{"$f":"VLOOKUP($B$19,Tablas!$A$84:$I$150,3,TRUE)+60+50","v":3722},{"$f":"VLOOKUP($B$19,Tablas!$A$84:$I$150,4,TRUE)+60+50","v":3034},{"$f":"VLOOKUP($B$19,Tablas!$A$84:$I$150,5,TRUE)+60+50","v":2348},{"$f":"VLOOKUP($B$19,Tablas!$A$84:$I$150,6,TRUE)+60+50","v":1748},{"$f":"VLOOKUP($B$19,Tablas!$A$84:$I$150,7,TRUE)+60+50","v":1094},{"$f":"VLOOKUP($B$19,Tablas!$A$84:$I$150,8,TRUE)+60+50","v":727},{"$f":"VLOOKUP($B$19,Tablas!$A$84:$I$150,9,TRUE)+60+50","v":503}]
["Prima para conyuge",null,{"$f":"IF($B$15=1,0,(VLOOKUP($I$19,Tablas!$A$84:$I$150,3,TRUE)))","v":3435},{"$f":"IF($B$15=1,0,(VLOOKUP($I$19,Tablas!$A$84:$I$150,4,TRUE)))","v":2768},{"$f":"IF($B$15=1,0,(VLOOKUP($I$19,Tablas!$A$84:$I$150,5,TRUE)))","v":2104},{"$f":"IF($B$15=1,0,(VLOOKUP($I$19,Tablas!$A$84:$I$150,6,TRUE)))","v":1527},{"$f":"IF($B$15=1,0,(VLOOKUP($I$19,Tablas!$A$84:$I$150,7,TRUE)))","v":912},{"$f":"IF($B$15=1,0,(VLOOKUP($I$19,Tablas!$A$84:$I$150,8,TRUE)))","v":566},{"$f":"IF($B$15=1,0,(VLOOKUP($I$19,Tablas!$A$84:$I$150,9,TRUE)))","v":356}]
["Prima para hijo (s)",null,{"$f":"IF($B$17=0,0,(VLOOKUP($B$17,Tablas!$A$151:$I$153,3,TRUE)))","v":1003},{"$f":"IF($B$17=0,0,(VLOOKUP($B$17,Tablas!$A$151:$I$153,4,TRUE)))","v":936},{"$f":"IF($B$17=0,0,(VLOOKUP($B$17,Tablas!$A$151:$I$153,5,TRUE)))","v":622},{"$f":"IF($B$17=0,0,(VLOOKUP($B$17,Tablas!$A$151:$I$153,6,TRUE)))","v":565},{"$f":"IF($B$17=0,0,(VLOOKUP($B$17,Tablas!$A$151:$I$153,7,TRUE)))","v":338},{"$f":"IF($B$17=0,0,(VLOOKUP($B$17,Tablas!$A$151:$I$153,8,TRUE)))","v":254},{"$f":"IF($B$17=0,0,(VLOOKUP($B$17,Tablas!$A$151:$I$153,9,TRUE)))","v":153}]
["Total de Prima neta",null,{"$f":"SUM(C30:C32)","v":8160},{"$f":"SUM(D30:D32)","v":6738},{"$f":"SUM(E30:E32)","v":5074},3840,2344,1547,1012]
["Ajuste por la variante con coaseguro fuera\n del país de residencia",null,{"$f":"IF('INGRESO DE DATOS'!$P$3,C33*-15%,0)","v":0},{"$f":"IF('INGRESO DE DATOS'!$P$3,D33*-15%,0)","v":0},{"$f":"IF('INGRESO DE DATOS'!$P$3,E33*-15%,0)","v":0},null,null,null,{"$f":"IF('INGRESO DE DATOS'!$P$3,I33*-15%,0)","v":0}]
["Contribución 3.5% Superintendencia de Bancos\n Contribución 0.5% Seguro Social Campesino",null,{"$f":"C33*Tablas!$AD$3","v":326.40000000000003},{"$f":"D33*Tablas!$AD$3","v":269.52},{"$f":"E33*Tablas!$AD$3","v":202.96},{"$f":"F33*Tablas!$AD$3","v":153.6},{"$f":"G33*Tablas!$AD$3","v":93.76},{"$f":"H33*Tablas!$AD$3","v":61.88},{"$f":"I33*Tablas!$AD$3","v":40.480000000000004}]
["VAT (5%) :"]
["ITBMS (7%)"]
["TOTAL ANUAL",null,{"$f":"SUM(C33:C37)","v":8486.4},{"$f":"SUM(D33:D37)","v":7007.52},5276.96,3993.6,2437.7600000000002,1608.88,1052.48]
[]
["TARIFAS SEMESTRALES"]
["Prima para Asegurado Titular",null,{"$f":"(C30-60-50)*Tablas!$M$4+(60/2)+50","v":1940.18},{"$f":"(D30-60-50)*Tablas!$M$4+(60/2)+50","v":1585.8600000000001},{"$f":"(E30-60-50)*Tablas!$M$4+(60/2)+50","v":1232.57},{"$f":"(F30-60-50)*Tablas!$M$4+(60/2)+50","v":923.57},{"$f":"(G30-60-50)*Tablas!$M$4+(60/2)+50","v":586.76},{"$f":"(H30-60-50)*Tablas!$M$4+(60/2)+50","v":397.755},{"$f":"(I30-60-50)*Tablas!$M$4+(60/2)+50","v":282.39499999999998}]
["Prima para conyuge",null,{"$f":"C31*Tablas!$M$4","v":1769.0250000000001},{"$f":"D31*Tablas!$M$4","v":1425.52},{"$f":"E31*Tablas!$M$4","v":1083.56},{"$f":"F31*Tablas!$M$4","v":786.40499999999997},{"$f":"G31*Tablas!$M$4","v":469.68},{"$f":"H31*Tablas!$M$4","v":291.49},{"$f":"I31*Tablas!$M$4","v":183.34}]
["Prima para hijo (s)",null,{"$f":"C32*Tablas!$M$4","v":516.54499999999996},{"$f":"D32*Tablas!$M$4","v":482.04},{"$f":"E32*Tablas!$M$4","v":320.33},{"$f":"F32*Tablas!$M$4","v":290.97500000000002},{"$f":"G32*Tablas!$M$4","v":174.07},{"$f":"H32*Tablas!$M$4","v":130.81},{"$f":"I32*Tablas!$M$4","v":78.795000000000002}]
["Total de Prima neta",null,{"$f":"SUM(C41:C43)","v":4225.75},{"$f":"SUM(D41:D43)","v":3493.42},2636.46,2000.9499999999998,1230.51,820.05500000000006,544.53]
["Ajuste por la variante con coaseguro fuera\n del país de residencia",null,{"$f":"IF('INGRESO DE DATOS'!$P$3,C44*-15%,0)","v":0},{"$f":"IF('INGRESO DE DATOS'!$P$3,D44*-15%,0)","v":0},{"$f":"IF('INGRESO DE DATOS'!$P$3,E44*-15%,0)","v":0},null,null,null,{"$f":"IF('INGRESO DE DATOS'!$P$3,I44*-15%,0)","v":0}]
[{"$f":"A35","v":"Contribución 3.5% Superintendencia de Bancos\n Contribución 0.5% Seguro Social Campesino"},null,{"$f":"C44*Tablas!$AD$3","v":169.03},{"$f":"D44*Tablas!$AD$3","v":139.73680000000002},{"$f":"E44*Tablas!$AD$3","v":105.4584},{"$f":"F44*Tablas!$AD$3","v":80.037999999999997},{"$f":"G44*Tablas!$AD$3","v":49.220399999999998},{"$f":"H44*Tablas!$AD$3","v":32.802200000000006},{"$f":"I44*Tablas!$AD$3","v":21.781199999999998}]
["VAT (5%) :"]
["ITBMS (7%)"]
["TOTAL de primera cuota",null,{"$f":"SUM(C44:C48)","v":4394.78},{"$f":"SUM(D44:D48)","v":3633.1568000000002},2741.9184,2080.9879999999998,1279.7303999999999,852.85720000000003,566.31119999999999]
["Costo de segunda cuota",null,{"$f":"C44+C46-52","v":4342.78},{"$f":"D44+D46-52","v":3581.1568000000002},2689.9184,2028.9879999999998,1227.7303999999999,800.85720000000003,514.31119999999999]
["TOTAL ANUAL",null,{"$f":"C49+C50","v":8737.56},{"$f":"D49+D50","v":7214.3136000000004},5431.8368,4109.9759999999997,2507.4607999999998,1653.7144000000001,1080.6224]
[]
["TARIFAS TRIMESTRALES"]
["Prima para Asegurado Titular",null,{"$f":"(C30-60-50)*Tablas!$M$3+(60/4)+50","v":1008.635},{"$f":"(D30-60-50)*Tablas!$M$3+(60/4)+50","v":828.89499999999998},{"$f":"(E30-60-50)*Tablas!$M$3+(60/4)+50","v":649.67750000000001},{"$f":"(F30-60-50)*Tablas!$M$3+(60/4)+50","v":492.92749999999995},{"$f":"(G30-60-50)*Tablas!$M$3+(60/4)+50","v":322.07},{"$f":"(H30-60-50)*Tablas!$M$3+(60/4)+50","v":226.19125},{"$f":"(I30-60-50)*Tablas!$M$3+(60/4)+50","v":167.67124999999999}]
["Prima para conyuge",null,{"$f":"C31*Tablas!$M$3","v":897.39374999999995},{"$f":"D31*Tablas!$M$3","v":723.14},{"$f":"E31*Tablas!$M$3","v":549.66999999999996},{"$f":"F31*Tablas!$M$3","v":398.92874999999998},{"$f":"G31*Tablas!$M$3","v":238.26},{"$f":"H31*Tablas!$M$3","v":147.86749999999998},{"$f":"I31*Tablas!$M$3","v":93.004999999999995}]
["Prima para hijo (s)",null,{"$f":"C32*Tablas!$M$3","v":262.03375},{"$f":"D32*Tablas!$M$3","v":244.52999999999997},{"$f":"E32*Tablas!$M$3","v":162.4975},{"$f":"F32*Tablas!$M$3","v":147.60624999999999},{"$f":"G32*Tablas!$M$3","v":88.302499999999995},{"$f":"H32*Tablas!$M$3","v":66.357500000000002},{"$f":"I32*Tablas!$M$3","v":39.971249999999998}]
["Total de Prima neta",null,{"$f":"SUM(C54:C56)","v":2168.0625},{"$f":"SUM(D54:D56)","v":1796.5649999999998},1361.8449999999998,1039.4624999999999,648.63249999999994,440.41624999999999,300.64749999999998]
["Ajuste por la variante con coaseguro fuera\n del país de residencia",null,{"$f":"IF('INGRESO DE DATOS'!$P$3,C57*-15%,0)","v":0},{"$f":"IF('INGRESO DE DATOS'!$P$3,D57*-15%,0)","v":0},{"$f":"IF('INGRESO DE DATOS'!$P$3,E57*-15%,0)","v":0},null,null,null,{"$f":"IF('INGRESO DE DATOS'!$P$3,I57*-15%,0)","v":0}]
[{"$f":"A35","v":"Contribución 3.5% Superintendencia de Bancos\n Contribución 0.5% Seguro Social Campesino"},null,{"$f":"C57*Tablas!$AD$3","v":86.722499999999997},{"$f":"D57*Tablas!$AD$3","v":71.8626},{"$f":"E57*Tablas!$AD$3","v":54.47379999999999},{"$f":"F57*Tablas!$AD$3","v":41.578499999999998},{"$f":"G57*Tablas!$AD$3","v":25.9453},{"$f":"H57*Tablas!$AD$3","v":17.61665},{"$f":"I57*Tablas!$AD$3","v":12.0259}]
["VAT (5%) :"]
["ITBMS (7%)"]
["TOTAL de primera cuota",null,{"$f":"SUM(C57:C61)","v":2254.7849999999999},{"$f":"SUM(D57:D61)","v":1868.4275999999998},1416.3187999999998,1081.0409999999999,674.57779999999991,458.03289999999998,312.67339999999996]
["Costo de tarifa trimestral 2 a 4",null,{"$f":"C57+C59-52","v":2202.7849999999999},{"$f":"D57+D59-52","v":1816.4275999999998},1364.3187999999998,1029.0409999999999,622.57779999999991,406.03289999999998,260.67339999999996]
["TOTAL ANUAL",null,{"$f":"C62+(C63*3)","v":8863.14},{"$f":"D62+(D63*3)","v":7317.710399999999},5509.2751999999991,4168.1639999999998,2542.3111999999996,1676.1315999999999,1094.6935999999998]
[]
["TARIFAS MENSUALES"]
["Prima para Asegurado Titular",null,{"$f":"(C30-60-50)*Tablas!$M$2+(60/12)+50","v":374.06},{"$f":"(D30-60-50)*Tablas!$M$2+(60/12)+50","v":313.28666666666669},{"$f":"(E30-60-50)*Tablas!$M$2+(60/12)+50","v":252.69},{"$f":"(F30-60-50)*Tablas!$M$2+(60/12)+50","v":199.69},{"$f":"(G30-60-50)*Tablas!$M$2+(60/12)+50","v":141.92000000000002},{"$f":"(H30-60-50)*Tablas!$M$2+(60/12)+50","v":109.50166666666667},{"$f":"(I30-60-50)*Tablas!$M$2+(60/12)+50","v":89.715000000000003}]
["Prima para conyuge",null,{"$f":"C31*Tablas!$M$2","v":303.42500000000001},{"$f":"D31*Tablas!$M$2","v":244.50666666666666},{"$f":"E31*Tablas!$M$2","v":185.85333333333332},{"$f":"F31*Tablas!$M$2","v":134.88499999999999},{"$f":"G31*Tablas!$M$2","v":80.56},{"$f":"H31*Tablas!$M$2","v":49.99666666666667},{"$f":"I31*Tablas!$M$2","v":31.446666666666665}]
["Prima para hijo (s)",null,{"$f":"C32*Tablas!$M$2","v":88.598333333333329},{"$f":"D32*Tablas!$M$2","v":82.68},{"$f":"E32*Tablas!$M$2","v":54.943333333333335},{"$f":"F32*Tablas!$M$2","v":49.908333333333331},{"$f":"G32*Tablas!$M$2","v":29.856666666666666},{"$f":"H32*Tablas!$M$2","v":22.436666666666667},{"$f":"I32*Tablas!$M$2","v":13.515000000000001}]
["Total de Prima neta",null,{"$f":"SUM(C67:C69)","v":766.08333333333337},{"$f":"SUM(D67:D69)","v":640.47333333333336},493.48666666666662,384.48333333333335,252.33666666666667,181.935,134.67666666666668]
["Ajuste por la variante con coaseguro fuera\n del país de residencia",null,{"$f":"IF('INGRESO DE DATOS'!$P$3,C70*-15%,0)","v":0},{"$f":"IF('INGRESO DE DATOS'!$P$3,D70*-15%,0)","v":0},{"$f":"IF('INGRESO DE DATOS'!$P$3,E70*-15%,0)","v":0},null,null,null,{"$f":"IF('INGRESO DE DATOS'!$P$3,I70*-15%,0)","v":0}]
[{"$f":"A59","v":"Contribución 3.5% Superintendencia de Bancos\n Contribución 0.5% Seguro Social Campesino"},null,{"$f":"C70*Tablas!$AD$3","v":30.643333333333334},{"$f":"D70*Tablas!$AD$3","v":25.618933333333334},{"$f":"E70*Tablas!$AD$3","v":19.739466666666665},{"$f":"F70*Tablas!$AD$3","v":15.379333333333335},{"$f":"G70*Tablas!$AD$3","v":10.093466666666668},{"$f":"H70*Tablas!$AD$3","v":7.2774000000000001},{"$f":"I70*Tablas!$AD$3","v":5.3870666666666676}]
["VAT (5%) :"]
["ITBMS (7%)"]
["TOTAL de primera cuota",null,{"$f":"SUM(C70:C74)","v":796.72666666666669},{"$f":"SUM(D70:D74)","v":666.09226666666666},513.22613333333334,399.86266666666666,262.43013333333334,189.2124,140.06373333333335]
["Costo de Tarifa mensual de 2 a 12",null,{"$f":"C70+C72-52","v":744.72666666666669},{"$f":"D70+D72-52","v":614.09226666666666},461.22613333333334,347.86266666666666,210.43013333333334,137.2124,88.063733333333346]
["TOTAL ANUAL",null,{"$f":"C75+(C76*11)","v":8988.7200000000012},{"$f":"D75+(D76*11)","v":7421.1071999999995},5586.7136,4226.3519999999999,2577.1615999999999,1698.5488,1108.7648000000002]
[]
["Este presupuesto solamente tiene carácter informativo y en ningún momento expresa compromiso legal para suministrarle cobertura de seguro. La emisión de una póliza de seguro Bupa está sujeta a todas las evaluaciones\nde riesgo por parte de Bupa y a la recepción de todos los pagos de prima requeridos."]

{"sheet":"Essential 1000","index":3,"n_rows":79,"n_cols":33,"rows_kept":79,"cut":false,"hidden":false,"merged":[[0,12,0,25],[0,27,0,40],[73,0,73,1],[74,0,74,1],[56,0,56,1],[22,0,22,1],[55,0,55,1],[59,0,59,1],[60,0,60,1],[66,0,66,1],[67,0,67,1],[68,0,68,1],[52,0,52,8],[63,0,63,1],[62,0,62,1],[42,0,42,1],[75,0,75,1],[76,0,76,1],[78,0,82,8],[69,0,69,1],[70,0,70,1],[71,0,71,1],[72,0,72,1],[61,0,61,1],[65,0,65,8],[58,0,58,1],[57,0,57,1],[54,0,54,1],[53,0,53,1],[43,0,43,1],[44,0,44,1],[45,0,45,1],[46,0,46,1],[47,0,47,1],[50,0,50,1],[49,0,49,1],[48,0,48,1],[39,0,39,8],[40,0,40,1],[41,0,41,1],[35,0,35,1],[36,0,36,1],[37,0,37,1],[4,8,5,8],[6,8,10,8],[4,0,10,7],[33,0,33,1],[34,0,34,1],[32,0,32,1],[12,1,12,8],[18,6,18,7],[20,1,20,3],[25,0,25,1],[26,0,26,1],[28,0,28,8],[29,0,29,1],[30,0,30,1],[31,0,31,1],[16,2,16,3]]}
[null,null,null,null,null,null,null,null,null,null,null,null,"RESUMEN DE BENEFICIOS",null,null,null,null,null,null,null,null,null,null,null,null,null,null,"RESUMEN DE BENEFICIOS"]
[]
[null,null,null,null,null,null,null,null,null,null,null,null,null,null,null," "," "," ",null,null,null,null,null,null,null,null,null,null,null,null," "," "," "]
[]
["Cotización de Seguro Médico\nEssential 1000\nTarifas en US$ | Validas: 1 de enero de 2025",null,null,null,null,null,null,null,"REGIÓN"]
[]
[null,null,null,null,null,null,null,null,{"$f":"'INGRESO DE DATOS'!W20","v":"Guayas/Santa Elena"},null,null,null,null,null,null," "," "," ",null,null,null,null,null,null,null,null,null,null,null,null," "," "," "]
[]
[]
[]
[]
[]
["Nombre del Asegurado Titular",{"$f":"+'INGRESO DE DATOS'!$C$37","v":"John Doe"}]
[]
["Número de adultos en la póliza",{"$f":"+'INGRESO DE DATOS'!$C$39","v":2}]
[]
["Número de Dependientes en la póliza",{"$f":"+'INGRESO DE DATOS'!$C$41","v":1},{"$f":"IF('INGRESO DE DATOS'!$P$2=TRUE, \"Cotización para dependiente de 24 años\",\"\")","v":""}]
[]
["Edad del Asegurado Titular",{"$f":"+'INGRESO DE DATOS'!$C$43","v":34},null,null,null,null,"Edad del/la conyuge",null,{"$f":"+'INGRESO DE DATOS'!$C$45","v":32},null,null,null," ",false,null," ",null,null,null,null,null,null,null,null,null,null,null," ",false,null," "]
[]
["Fecha de la cotización",{"$f":"NOW()","v":"2026-01-06T09:23:13.540"}]
[]
[{"$f":"IF('INGRESO DE DATOS'!P3=TRUE,\"Variante con coaseguro fuera del país de residencia: SI\",\"Variante con coaseguro fuera del país de residencia: NO\")","v":"Variante con coaseguro fuera del país de residencia: NO"}]
[null,null,{"$f":"1-(IF('INGRESO DE DATOS'!$T$19=6,'INGRESO DE DATOS'!U48,IF('INGRESO DE DATOS'!$T$19=8,'INGRESO DE DATOS'!U56,0)))","v":1},{"$f":"1-(IF('INGRESO DE DATOS'!$T$19=6,'INGRESO DE DATOS'!V48,IF('INGRESO DE DATOS'!$T$19=8,'INGRESO DE DATOS'!V56,0)))","v":1},{"$f":"1-(IF('INGRESO DE DATOS'!$T$19=6,'INGRESO DE DATOS'!W48,IF('INGRESO DE DATOS'!$T$19=8,'INGRESO DE DATOS'!W56,0)))","v":1},{"$f":"1-(IF('INGRESO DE DATOS'!$T$19=6,'INGRESO DE DATOS'!X48,IF('INGRESO DE DATOS'!$T$19=8,'INGRESO DE DATOS'!X56,0)))","v":1},{"$f":"1-(IF('INGRESO DE DATOS'!$T$19=6,'INGRESO DE DATOS'!Y48,IF('INGRESO DE DATOS'!$T$19=8,'INGRESO DE DATOS'!Y56,0)))","v":1},{"$f":"1-(IF('INGRESO DE DATOS'!$T$19=6,'INGRESO DE DATOS'!Z48,IF('INGRESO DE DATOS'!$T$19=8,'INGRESO DE DATOS'!Z56,0)))","v":1},{"$f":"1-(IF('INGRESO DE DATOS'!$T$19=6,'INGRESO DE DATOS'!AA48,IF('INGRESO DE DATOS'!$T$19=8,'INGRESO DE DATOS'!AA56,0)))","v":1}]
["DEDUCIBlES",null,"PLAN 1","PLAN 2","PLAN 3","PLAN 4","PLAN 5","PLAN 6","PLAN 7"]
["En el país de residencia",null,250,500,1000,2000,5000,10000,20000]
["Fuera del país de residencia",null,500,1000,2000,4000,5000,10000,20000]
[]
["TARIFAS ANUALES"]
["Prima para Asegurado Titular",null,{"$f":"(VLOOKUP($B$19,Tablas!$A$9:$I$75,3,TRUE)*C24)+(60)+50","v":4547},{"$f":"(VLOOKUP($B$19,Tablas!$A$9:$I$75,4,TRUE)*D24)+(60)+50","v":3967},{"$f":"(VLOOKUP($B$19,Tablas!$A$9:$I$75,5,TRUE)*E24)+(60)+50","v":3215},{"$f":"(VLOOKUP($B$19,Tablas!$A$9:$I$75,6,TRUE)*F24)+(60)+50","v":2400},{"$f":"(VLOOKUP($B$19,Tablas!$A$9:$I$75,7,TRUE)*G24)+(60)+50","v":1502},{"$f":"(VLOOKUP($B$19,Tablas!$A$9:$I$75,8,TRUE)*H24)+(60)+50","v":990},{"$f":"(VLOOKUP($B$19,Tablas!$A$9:$I$75,9,TRUE)*I24)+(60)+50","v":679}]
["Prima para conyuge",null,{"$f":"(IF($B$15=1,0,(VLOOKUP($I$19,Tablas!$A$9:$I$75,3,TRUE)))*C24)","v":4208},{"$f":"(IF($B$15=1,0,(VLOOKUP($I$19,Tablas!$A$9:$I$75,4,TRUE)))*D24)","v":3656},{"$f":"(IF($B$15=1,0,(VLOOKUP($I$19,Tablas!$A$9:$I$75,5,TRUE)))*E24)","v":2924},{"$f":"(IF($B$15=1,0,(VLOOKUP($I$19,Tablas!$A$9:$I$75,6,TRUE)))*F24)","v":2144},{"$f":"(IF($B$15=1,0,(VLOOKUP($I$19,Tablas!$A$9:$I$75,7,TRUE)))*G24)","v":1289},{"$f":"(IF($B$15=1,0,(VLOOKUP($I$19,Tablas!$A$9:$I$75,8,TRUE)))*H24)","v":808},{"$f":"(IF($B$15=1,0,(VLOOKUP($I$19,Tablas!$A$9:$I$75,9,TRUE)))*I24)","v":516}]
["Prima para hijo (s)",null,{"$f":"(IF($B$17=0,0,(VLOOKUP($B$17,Tablas!$A$76:$I$78,3,TRUE)))*C24)","v":1022},{"$f":"(IF($B$17=0,0,(VLOOKUP($B$17,Tablas!$A$76:$I$78,4,TRUE)))*D24)","v":1059},{"$f":"(IF($B$17=0,0,(VLOOKUP($B$17,Tablas!$A$76:$I$78,5,TRUE)))*E24)","v":653},{"$f":"(IF($B$17=0,0,(VLOOKUP($B$17,Tablas!$A$76:$I$78,6,TRUE)))*F24)","v":583},{"$f":"(IF($B$17=0,0,(VLOOKUP($B$17,Tablas!$A$76:$I$78,7,TRUE)))*G24)","v":415},{"$f":"(IF($B$17=0,0,(VLOOKUP($B$17,Tablas!$A$76:$I$78,8,TRUE)))*H24)","v":368},{"$f":"(IF($B$17=0,0,(VLOOKUP($B$17,Tablas!$A$76:$I$78,9,TRUE)))*I24)","v":216}]
["Total de Prima neta",null,{"$f":"SUM(C30:C32)","v":9777},{"$f":"SUM(D30:D32)","v":8682},6792,5127,3206,2166,1411]
["Ajuste por la variante con coaseguro fuera\n del país de residencia",null,{"$f":"IF('INGRESO DE DATOS'!$P$3,C33*-15%,0)","v":0},{"$f":"IF('INGRESO DE DATOS'!$P$3,D33*-15%,0)","v":0},{"$f":"IF('INGRESO DE DATOS'!$P$3,E33*-15%,0)","v":0},{"$f":"IF('INGRESO DE DATOS'!$P$3,F33*-15%,0)","v":0},null,null,{"$f":"IF('INGRESO DE DATOS'!$P$3,I33*-15%,0)","v":0}]
["Contribución 3.5% Superintendencia de Bancos\n Contribución 0.5% Seguro Social Campesino",null,{"$f":"C33*Tablas!$AD$3","v":391.08},{"$f":"D33*Tablas!$AD$3","v":347.28000000000003},{"$f":"E33*Tablas!$AD$3","v":271.68},{"$f":"F33*Tablas!$AD$3","v":205.08},{"$f":"G33*Tablas!$AD$3","v":128.24},{"$f":"H33*Tablas!$AD$3","v":86.64},{"$f":"I33*Tablas!$AD$3","v":56.44}]
["VAT (5%) :"]
["ITBMS (7%)"]
["TOTAL ANUAL",null,{"$f":"SUM(C33:C37)","v":10168.08},{"$f":"SUM(D33:D37)","v":9029.2800000000007},7063.68,5332.08,3334.24,2252.64,1467.44]
[]
["TARIFAS SEMIANUALES"]
["Prima para Asegurado Titular",null,{"$f":"(C30-60-50)*Tablas!$M$4+(60/2)+50","v":2365.0549999999998},{"$f":"(D30-60-50)*Tablas!$M$4+(60/2)+50","v":2066.355},{"$f":"(E30-60-50)*Tablas!$M$4+(60/2)+50","v":1679.075},{"$f":"(F30-60-50)*Tablas!$M$4+(60/2)+50","v":1259.3500000000001},{"$f":"(G30-60-50)*Tablas!$M$4+(60/2)+50","v":796.88},{"$f":"(H30-60-50)*Tablas!$M$4+(60/2)+50","v":533.20000000000005},{"$f":"(I30-60-50)*Tablas!$M$4+(60/2)+50","v":373.03500000000003}]
["Prima para conyuge",null,{"$f":"C31*Tablas!$M$4","v":2167.12},{"$f":"D31*Tablas!$M$4","v":1882.8400000000001},{"$f":"E31*Tablas!$M$4","v":1505.8600000000001},{"$f":"F31*Tablas!$M$4","v":1104.1600000000001},{"$f":"G31*Tablas!$M$4","v":663.83500000000004},{"$f":"H31*Tablas!$M$4","v":416.12},{"$f":"I31*Tablas!$M$4","v":265.74}]
["Prima para hijo (s)",null,{"$f":"C32*Tablas!$M$4","v":526.33000000000004},{"$f":"D32*Tablas!$M$4","v":545.38499999999999},{"$f":"E32*Tablas!$M$4","v":336.29500000000002},{"$f":"F32*Tablas!$M$4","v":300.245},{"$f":"G32*Tablas!$M$4","v":213.72499999999999},{"$f":"H32*Tablas!$M$4","v":189.52},{"$f":"I32*Tablas!$M$4","v":111.24000000000001}]
["Total de Prima neta",null,{"$f":"SUM(C41:C43)","v":5058.5049999999992},{"$f":"SUM(D41:D43)","v":4494.58},3521.2300000000005,2663.7550000000001,1674.44,1138.8400000000001,750.0150000000001]
["Ajuste por la variante con coaseguro fuera\n del país de residencia",null,{"$f":"IF('INGRESO DE DATOS'!$P$3,C44*-15%,0)","v":0},{"$f":"IF('INGRESO DE DATOS'!$P$3,D44*-15%,0)","v":0},{"$f":"IF('INGRESO DE DATOS'!$P$3,E44*-15%,0)","v":0},{"$f":"IF('INGRESO DE DATOS'!$P$3,F44*-15%,0)","v":0},null,null,{"$f":"IF('INGRESO DE DATOS'!$P$3,I44*-15%,0)","v":0}]
[{"$f":"A35","v":"Contribución 3.5% Superintendencia de Bancos\n Contribución 0.5% Seguro Social Campesino"},null,{"$f":"C44*Tablas!$AD$3","v":202.34019999999998},{"$f":"D44*Tablas!$AD$3","v":179.78319999999999},{"$f":"E44*Tablas!$AD$3","v":140.84920000000002},{"$f":"F44*Tablas!$AD$3","v":106.5502},{"$f":"G44*Tablas!$AD$3","v":66.97760000000001},{"$f":"H44*Tablas!$AD$3","v":45.55360000000001},{"$f":"I44*Tablas!$AD$3","v":30.000600000000006}]
["VAT (5%) :"]
["ITBMS (7%)"]
["TOTAL de primera cuota",null,{"$f":"SUM(C44:C48)","v":5260.8451999999988},{"$f":"SUM(D44:D48)","v":4674.3631999999998},3662.0792000000006,2770.3052000000002,1741.4176,1184.3936000000001,780.01560000000006]
["Costo de segunda cuota",null,{"$f":"C44+C46-52","v":5208.8451999999988},{"$f":"D44+D46-52","v":4622.3631999999998},3610.0792000000006,2718.3052000000002,1689.4176,1132.3936000000001,728.01560000000006]
["TOTAL ANUAL",null,{"$f":"C49+C50","v":10469.690399999998},{"$f":"D49+D50","v":9296.7263999999996},7272.1584000000012,5488.6104000000005,3430.8352,2316.7872000000002,1508.0312000000001]
[]
["TARIFAS TRIMESTRALES"]
["Prima para Asegurado Titular",null,{"$f":"(C30-60-50)*Tablas!$M$3+(60/4)+50","v":1224.16625},{"$f":"(D30-60-50)*Tablas!$M$3+(60/4)+50","v":1072.6412499999999},{"$f":"(E30-60-50)*Tablas!$M$3+(60/4)+50","v":876.18124999999998},{"$f":"(F30-60-50)*Tablas!$M$3+(60/4)+50","v":663.26249999999993},{"$f":"(G30-60-50)*Tablas!$M$3+(60/4)+50","v":428.65999999999997},{"$f":"(H30-60-50)*Tablas!$M$3+(60/4)+50","v":294.89999999999998},{"$f":"(I30-60-50)*Tablas!$M$3+(60/4)+50","v":213.65124999999998}]
["Prima para conyuge",null,{"$f":"C31*Tablas!$M$3","v":1099.3399999999999},{"$f":"D31*Tablas!$M$3","v":955.12999999999988},{"$f":"E31*Tablas!$M$3","v":763.89499999999998},{"$f":"F31*Tablas!$M$3","v":560.12},{"$f":"G31*Tablas!$M$3","v":336.75124999999997},{"$f":"H31*Tablas!$M$3","v":211.08999999999997},{"$f":"I31*Tablas!$M$3","v":134.80499999999998}]
["Prima para hijo (s)",null,{"$f":"C32*Tablas!$M$3","v":266.9975},{"$f":"D32*Tablas!$M$3","v":276.66374999999999},{"$f":"E32*Tablas!$M$3","v":170.59625},{"$f":"F32*Tablas!$M$3","v":152.30875},{"$f":"G32*Tablas!$M$3","v":108.41874999999999},{"$f":"H32*Tablas!$M$3","v":96.139999999999986},{"$f":"I32*Tablas!$M$3","v":56.429999999999993}]
["Total de Prima neta",null,{"$f":"SUM(C54:C56)","v":2590.5037499999999},{"$f":"SUM(D54:D56)","v":2304.4349999999999},1810.6725000000001,1375.6912499999999,873.82999999999993,602.12999999999988,404.88624999999996]
["Ajuste por la variante con coaseguro\n fuera del país de residencia",null,{"$f":"IF('INGRESO DE DATOS'!$P$3,C57*-15%,0)","v":0},{"$f":"IF('INGRESO DE DATOS'!$P$3,D57*-15%,0)","v":0},{"$f":"IF('INGRESO DE DATOS'!$P$3,E57*-15%,0)","v":0},{"$f":"IF('INGRESO DE DATOS'!$P$3,F57*-15%,0)","v":0},null,null,{"$f":"IF('INGRESO DE DATOS'!$P$3,I57*-15%,0)","v":0}]
[{"$f":"A35","v":"Contribución 3.5% Superintendencia de Bancos\n Contribución 0.5% Seguro Social Campesino"},null,{"$f":"C57*Tablas!$AD$3","v":103.62015},{"$f":"D57*Tablas!$AD$3","v":92.177400000000006},{"$f":"E57*Tablas!$AD$3","v":72.426900000000003},{"$f":"F57*Tablas!$AD$3","v":55.027649999999994},{"$f":"G57*Tablas!$AD$3","v":34.953199999999995},{"$f":"H57*Tablas!$AD$3","v":24.085199999999997},{"$f":"I57*Tablas!$AD$3","v":16.195449999999997}]
["VAT (5%) :"]
["ITBMS (7%)"]
["TOTAL de primera cuota",null,{"$f":"SUM(C57:C61)","v":2694.1239},{"$f":"SUM(D57:D61)","v":2396.6124},1883.0994000000001,1430.7188999999998,908.78319999999997,626.21519999999987,421.08169999999996]
["Costo de tarifa trimestral 2 a 4",null,{"$f":"C57+C59-52","v":2642.1239},{"$f":"D57+D59-52","v":2344.6124},1831.0994000000001,1378.7188999999998,856.78319999999997,574.21519999999987,369.08169999999996]
["TOTAL ANUAL",null,{"$f":"C62+(C63*3)","v":10620.4956},{"$f":"D62+(D63*3)","v":9430.4495999999999},7376.3976000000002,5566.8755999999994,3479.1327999999999,2348.8607999999995,1528.3267999999998]
[]
["TARIFAS MENSUALES"]
["Prima para Asegurado Titular",null,{"$f":"(C30-60-50)*Tablas!$M$2+(60/12)+50","v":446.935},{"$f":"(D30-60-50)*Tablas!$M$2+(60/12)+50","v":395.70166666666665},{"$f":"(E30-60-50)*Tablas!$M$2+(60/12)+50","v":329.27499999999998},{"$f":"(F30-60-50)*Tablas!$M$2+(60/12)+50","v":257.2833333333333},{"$f":"(G30-60-50)*Tablas!$M$2+(60/12)+50","v":177.95999999999998},{"$f":"(H30-60-50)*Tablas!$M$2+(60/12)+50","v":132.73333333333335},{"$f":"(I30-60-50)*Tablas!$M$2+(60/12)+50","v":105.26166666666666}]
["Prima para conyuge",null,{"$f":"C31*Tablas!$M$2","v":371.70666666666665},{"$f":"D31*Tablas!$M$2","v":322.94666666666666},{"$f":"E31*Tablas!$M$2","v":258.28666666666669},{"$f":"F31*Tablas!$M$2","v":189.38666666666666},{"$f":"G31*Tablas!$M$2","v":113.86166666666666},{"$f":"H31*Tablas!$M$2","v":71.373333333333335},{"$f":"I31*Tablas!$M$2","v":45.58}]
["Prima para hijo (s)",null,{"$f":"C32*Tablas!$M$2","v":90.276666666666671},{"$f":"D32*Tablas!$M$2","v":93.545000000000002},{"$f":"E32*Tablas!$M$2","v":57.681666666666665},{"$f":"F32*Tablas!$M$2","v":51.498333333333335},{"$f":"G32*Tablas!$M$2","v":36.658333333333331},{"$f":"H32*Tablas!$M$2","v":32.506666666666668},{"$f":"I32*Tablas!$M$2","v":19.079999999999998}]
["Total de Prima neta",null,{"$f":"SUM(C67:C69)","v":908.91833333333329},{"$f":"SUM(D67:D69)","v":812.19333333333327},645.24333333333334,498.16833333333329,328.48,236.61333333333334,169.92166666666662]
["Ajuste por la variante con coaseguro fuera\n del país de residencia",null,{"$f":"IF('INGRESO DE DATOS'!$P$3,C70*-15%,0)","v":0},{"$f":"IF('INGRESO DE DATOS'!$P$3,D70*-15%,0)","v":0},{"$f":"IF('INGRESO DE DATOS'!$P$3,E70*-15%,0)","v":0},{"$f":"IF('INGRESO DE DATOS'!$P$3,F70*-15%,0)","v":0},null,null,{"$f":"IF('INGRESO DE DATOS'!$P$3,I70*-15%,0)","v":0}]
[{"$f":"A59","v":"Contribución 3.5% Superintendencia de Bancos\n Contribución 0.5% Seguro Social Campesino"},null,{"$f":"C70*Tablas!$AD$3","v":36.356733333333331},{"$f":"D70*Tablas!$AD$3","v":32.487733333333331},{"$f":"E70*Tablas!$AD$3","v":25.809733333333334},{"$f":"F70*Tablas!$AD$3","v":19.926733333333331},{"$f":"G70*Tablas!$AD$3","v":13.139200000000001},{"$f":"H70*Tablas!$AD$3","v":9.4645333333333337},{"$f":"I70*Tablas!$AD$3","v":6.7968666666666655}]
["VAT (5%) :"]
["ITBMS (7%)"]
["TOTAL de primera cuota",null,{"$f":"SUM(C70:C74)","v":945.27506666666659},{"$f":"SUM(D70:D74)","v":844.68106666666665},671.05306666666672,518.09506666666664,341.61920000000003,246.07786666666667,176.71853333333328]
["Costo de Tarifa mensual de 2 a 12",null,{"$f":"C70+C72-52","v":893.27506666666659},{"$f":"D70+D72-52","v":792.68106666666665},619.05306666666672,466.09506666666664,289.61920000000003,194.07786666666667,124.71853333333328]
["TOTAL ANUAL",null,{"$f":"C75+(C76*11)","v":10771.300799999999},{"$f":"D75+(D76*11)","v":9564.1727999999985},7480.6368000000002,5645.1408000000001,3527.4304000000006,2380.9343999999996,1548.6223999999993]
[]
["Este presupuesto solamente tiene carácter informativo y en ningún momento expresa compromiso legal para suministrarle cobertura de seguro.\nLa emisión de una póliza de seguro Bupa está sujeta a todas las evaluaciones de riesgo por parte de Bupa y a la recepción de todos los pagos \nde prima requeridos."]

{"sheet":"Resumen Tarifas","index":4,"n_rows":61,"n_cols":8,"rows_kept":61,"cut":false,"hidden":true,"merged":[[60,0,67,7],[22,0,22,7],[26,1,26,7],[28,1,28,7],[30,1,30,7],[32,1,32,7],[43,1,43,7],[45,1,45,7],[53,0,56,0],[53,1,53,6],[55,1,55,6],[49,0,49,6],[0,0,3,5],[20,1,20,2],[26,0,33,0],[39,0,46,0],[12,1,12,7],[35,0,35,7],[39,1,39,7],[41,1,41,7],[4,7,5,7],[6,7,10,7],[4,0,10,6],[16,2,16,3]]}
[" "]
[]
[]
[]
["Cotización de Seguro Médico Internacional\nBupa Essential \nTarifas en US$ | Validas: 1 de enero de 2025",null,null,null,null,null,null,"REGIÓN"]
[]
[null,null,null,null,null,null,null,{"$f":"'INGRESO DE DATOS'!W20","v":"Guayas/Santa Elena"}]
[]
[]
[]
[]
[]
["Nombre del Asegurado Titular",{"$f":"+'INGRESO DE DATOS'!$C$37","v":"John Doe"}]
[]
["Número de adultos en la póliza",{"$f":"+'INGRESO DE DATOS'!$C$39","v":2}]
[]
["Número de Dependientes en la póliza",{"$f":"+'INGRESO DE DATOS'!$C$41","v":1},{"$f":"IF('INGRESO DE DATOS'!$P$2=TRUE, \"Cotización para dependiente de 24 años\",\"\")","v":""}]
[]
["Edad del Asegurado Titular",{"$f":"+'INGRESO DE DATOS'!$C$43","v":34},null,null,null,"Edad del/la conyuge",null,{"$f":"+'INGRESO DE DATOS'!$C$45","v":32}]
[]
["Fecha de la cotización",{"$f":"NOW()","v":"2026-01-06T09:23:13.540"}]
[]
["Essential 1000"]
["DEDUCIBLES","PLAN 1","PLAN 2","PLAN 3","PLAN 4","PLAN 5","PLAN 6","PLAN 7"]
["En el país de residencia",250,500,1000,2000,5000,10000,20000]
["Fuera del país de residencia",500,1000,2000,4000,5000,10000,20000]
[null,"TARIFAS ANUALES"]
[null,{"$f":"'Essential 1000'!C38","v":10168.08},{"$f":"'Essential 1000'!D38","v":9029.2800000000007},{"$f":"'Essential 1000'!E38","v":7063.68},{"$f":"'Essential 1000'!F38","v":5332.08},{"$f":"'Essential 1000'!G38","v":3334.24},{"$f":"'Essential 1000'!H38","v":2252.64},{"$f":"'Essential 1000'!I38","v":1467.44}]
[null,"TARIFAS SEMESTRALES"]
[null,{"$f":"+'Essential 1000'!C51","v":10469.690399999998},{"$f":"+'Essential 1000'!D51","v":9296.7263999999996},{"$f":"+'Essential 1000'!E51","v":7272.1584000000012},{"$f":"+'Essential 1000'!F51","v":5488.6104000000005},{"$f":"+'Essential 1000'!G51","v":3430.8352},{"$f":"+'Essential 1000'!H51","v":2316.7872000000002},{"$f":"+'Essential 1000'!I51","v":1508.0312000000001}]
[null,"TARIFAS TRIMESTRALES"]
[null,{"$f":"+'Essential 1000'!C64","v":10620.4956},{"$f":"+'Essential 1000'!D64","v":9430.4495999999999},{"$f":"+'Essential 1000'!E64","v":7376.3976000000002},{"$f":"+'Essential 1000'!F64","v":5566.8755999999994},{"$f":"+'Essential 1000'!G64","v":3479.1327999999999},{"$f":"+'Essential 1000'!H64","v":2348.8607999999995},{"$f":"+'Essential 1000'!I64","v":1528.3267999999998}]
[null,"TARIFAS MENSUALES"]
[null,{"$f":"+'Essential 1000'!C77","v":10771.300799999999},{"$f":"+'Essential 1000'!D77","v":9564.1727999999985},{"$f":"+'Essential 1000'!E77","v":7480.6368000000002},{"$f":"+'Essential 1000'!F77","v":5645.1408000000001},{"$f":"+'Essential 1000'!G77","v":3527.4304000000006},{"$f":"+'Essential 1000'!H77","v":2380.9343999999996},{"$f":"+'Essential 1000'!I77","v":1548.6223999999993}]
[]
["Essential 500"]
["DEDUCIBLES","PLAN 1","PLAN 2","PLAN 3","PLAN 4","PLAN 5","PLAN 6","PLAN 7"]
["En el país de residencia",250,500,1000,2000,5000,10000,20000]
["Fuera del país de residencia",500,1000,2000,4000,5000,10000,20000]
[null,"TARIFAS ANUALES"]
[null,{"$f":"+'Essential 500'!C38","v":8486.4},{"$f":"+'Essential 500'!D38","v":7007.52},{"$f":"+'Essential 500'!E38","v":5276.96},{"$f":"+'Essential 500'!F38","v":3993.6},{"$f":"+'Essential 500'!G38","v":2437.7600000000002},{"$f":"+'Essential 500'!H38","v":1608.88},{"$f":"+'Essential 500'!I38","v":1052.48}]
[null,"TARIFAS SEMESTRALES"]
[null,{"$f":"+'Essential 500'!C51","v":8737.56},{"$f":"+'Essential 500'!D51","v":7214.3136000000004},{"$f":"+'Essential 500'!E51","v":5431.8368},{"$f":"+'Essential 500'!F51","v":4109.9759999999997},{"$f":"+'Essential 500'!G51","v":2507.4607999999998},{"$f":"+'Essential 500'!H51","v":1653.7144000000001},{"$f":"+'Essential 500'!I51","v":1080.6224}]
[null,"TARIFAS TRIMESTRALES"]
[null,{"$f":"+'Essential 500'!C64","v":8863.14},{"$f":"+'Essential 500'!D64","v":7317.710399999999},{"$f":"+'Essential 500'!E64","v":5509.2751999999991},{"$f":"+'Essential 500'!F64","v":4168.1639999999998},{"$f":"+'Essential 500'!G64","v":2542.3111999999996},{"$f":"+'Essential 500'!H64","v":1676.1315999999999},{"$f":"+'Essential 500'!I64","v":1094.6935999999998}]
[null,"TARIFAS MENSUALES"]
[null,{"$f":"+'Essential 500'!C77","v":8988.7200000000012},{"$f":"+'Essential 500'!D77","v":7421.1071999999995},{"$f":"+'Essential 500'!E77","v":5586.7136},{"$f":"+'Essential 500'!F77","v":4226.3519999999999},{"$f":"+'Essential 500'!G77","v":2577.1615999999999},{"$f":"+'Essential 500'!H77","v":1698.5488},{"$f":"+'Essential 500'!I77","v":1108.7648000000002}]
[]
[]
["Essential Care (Renovaciones)"]
["DEDUCIBLES","PLAN 1","PLAN 2","PLAN 3","PLAN 4","PLAN 5","PLAN 6"]
["En el país de residencia","$0",1000,2000,5000,10000,20000]
["Fuera del país de residencia",1000,2000,3000,5000,10000,20000]
[null,"TARIFAS ANUALES"]
[null,{"$f":"'Essential Care (Renovación)'!B39","v":14404.364},{"$f":"'Essential Care (Renovación)'!C39","v":13282.567999999999},{"$f":"'Essential Care (Renovación)'!D39","v":12643.435999999998},{"$f":"'Essential Care (Renovación)'!E39","v":9426.56},{"$f":"'Essential Care (Renovación)'!F39","v":7529.4959999999992},{"$f":"'Essential Care (Renovación)'!G39","v":5870.2280000000001}]
[null,"TARIFAS SEMESTRALES"]
[null,{"$f":"'Essential Care (Renovación)'!B53","v":15263.945839999998},{"$f":"'Essential Care (Renovación)'!C53","v":14074.84208},{"$f":"'Essential Care (Renovación)'!D53","v":13397.362159999999},{"$f":"'Essential Care (Renovación)'!E53","v":9987.4736000000012},{"$f":"'Essential Care (Renovación)'!F53","v":7976.5857600000008},{"$f":"'Essential Care (Renovación)'!G53","v":6217.7616799999987}]
[]
[]
[]
["Este presupuesto solamente tiene carácter informativo y en ningún momento expresa compromiso legal para suministrarle cobertura de seguro. La emisión de una póliza de seguro Bupa está sujeta a todas las evaluaciones de riesgo por parte de Bupa y a la recepción de todos los pagos de prima requeridos.\n\nUna tarifa administrativa de US$75 se cargará automáticamente al primer pago.\n\n*Basado en un modo de pago anual"]

{"sheet":"Tablas","index":5,"n_rows":187,"n_cols":30,"rows_kept":187,"cut":false,"hidden":true,"merged":[[4,0,4,8],[5,0,5,8],[6,0,6,8],[1,26,1,28],[2,14,2,15],[3,14,3,15],[1,10,1,11],[2,26,2,28],[1,0,1,7],[3,0,3,7],[6,10,6,11],[7,10,7,16],[82,10,82,16],[7,18,7,24],[82,18,82,24],[7,0,7,1],[82,0,82,1],[79,0,79,8],[80,0,80,8],[81,0,81,8],[154,0,154,8],[155,0,155,8],[157,10,157,16],[157,18,157,24],[156,0,156,8],[157,0,157,1]]}
[]
[null,null,null,null,null,null,null,null,null,null,"FACTOR MENSUAL:",null,8.8333333333333333E-2,null,"Descuento de 24 años",{"$f":"'INGRESO DE DATOS'!P30","v":1},null,null,"Essential","Essential 1000","Essential 500",null,null,null,null,null,"Impuesto (14.94%)",null,null,1]
[null,null,null,null,null,null,null,null,null,null,"FACTOR TRIMESTRAL:",null,0.26124999999999998,null,"Descuento de producto (%)",null,null,null,{"$f":"'INGRESO DE DATOS'!O39","v":0.15},{"$f":"'INGRESO DE DATOS'!P39","v":0},{"$f":"'INGRESO DE DATOS'!Q39","v":0},{"$f":"'INGRESO DE DATOS'!R39","v":0},{"$f":"'INGRESO DE DATOS'!S39","v":0},null,null,null,"Total impuestos Bolivia",null,null,0.04]
[null,null,null,null,null,null,null,null,null,null,"FACTOR SEMIANUAL:",null,0.51500000000000001,null,"Factor para el descuento combinado",null,null,null,{"$f":"'INGRESO DE DATOS'!O47","v":0.85},{"$f":"'INGRESO DE DATOS'!P47","v":1},{"$f":"'INGRESO DE DATOS'!Q47","v":1},{"$f":"'INGRESO DE DATOS'!R47","v":0},{"$f":"'INGRESO DE DATOS'!S47","v":0}]
["BUPA ESSENTIAL 1000",null,null,null,null,null,null,null,null,null,"FACTOR SEMIANUAL (Essential Care):",null,0.53]
["TARIFAS ANUALES",null,null,null,null,null,null,null,null,null,"FACTOR TRIMESTRAL (Essential Care):",null,0.27500000000000002]
[null,null,null,null,null,null,null,null,null,null,"FACTOR MENSUAL (Essential Care):",null,9.3329999999999996E-2]
["EDAD",null,250,500,1000,2000,5000,10000,20000,null,"TARIFAS BASE",null,null,null,null,null,null,null,"TARIFAS BASE COND ESCUENTO"]
[18,null,{"$f":"S9*$AD$2","v":3327},{"$f":"T9*$AD$2","v":2898},{"$f":"U9*$AD$2","v":2485},{"$f":"V9*$AD$2","v":1733},{"$f":"W9*$AD$2","v":956},{"$f":"X9*$AD$2","v":558},{"$f":"Y9*$AD$2","v":327},null,{"$f":"IF('INGRESO DE DATOS'!$W$19=1,'Tablas Guyanas y Santa Elena'!C6,'Tablas Resto de Ecuador'!C6)","v":3327},{"$f":"IF('INGRESO DE DATOS'!$W$19=1,'Tablas Guyanas y Santa Elena'!D6,'Tablas Resto de Ecuador'!D6)","v":2898},{"$f":"IF('INGRESO DE DATOS'!$W$19=1,'Tablas Guyanas y Santa Elena'!E6,'Tablas Resto de Ecuador'!E6)","v":2485},{"$f":"IF('INGRESO DE DATOS'!$W$19=1,'Tablas Guyanas y Santa Elena'!F6,'Tablas Resto de Ecuador'!F6)","v":1733},{"$f":"IF('INGRESO DE DATOS'!$W$19=1,'Tablas Guyanas y Santa Elena'!G6,'Tablas Resto de Ecuador'!G6)","v":956},{"$f":"IF('INGRESO DE DATOS'!$W$19=1,'Tablas Guyanas y Santa Elena'!H6,'Tablas Resto de Ecuador'!H6)","v":558},{"$f":"IF('INGRESO DE DATOS'!$W$19=1,'Tablas Guyanas y Santa Elena'!I6,'Tablas Resto de Ecuador'!I6)","v":327},null,{"$f":"K9*$T$4","v":3327},{"$f":"L9*$T$4","v":2898},2485,1733,956,558,327]
[19,null,{"$f":"S10*$AD$2","v":3384},{"$f":"T10*$AD$2","v":2948},{"$f":"U10*$AD$2","v":2485},{"$f":"V10*$AD$2","v":1733},{"$f":"W10*$AD$2","v":964},{"$f":"X10*$AD$2","v":564},{"$f":"Y10*$AD$2","v":333},null,{"$f":"IF('INGRESO DE DATOS'!$W$19=1,'Tablas Guyanas y Santa Elena'!C7,'Tablas Resto de Ecuador'!C7)","v":3384},{"$f":"IF('INGRESO DE DATOS'!$W$19=1,'Tablas Guyanas y Santa Elena'!D7,'Tablas Resto de Ecuador'!D7)","v":2948},{"$f":"IF('INGRESO DE DATOS'!$W$19=1,'Tablas Guyanas y Santa Elena'!E7,'Tablas Resto de Ecuador'!E7)","v":2485},{"$f":"IF('INGRESO DE DATOS'!$W$19=1,'Tablas Guyanas y Santa Elena'!F7,'Tablas Resto de Ecuador'!F7)","v":1733},{"$f":"IF('INGRESO DE DATOS'!$W$19=1,'Tablas Guyanas y Santa Elena'!G7,'Tablas Resto de Ecuador'!G7)","v":964},{"$f":"IF('INGRESO DE DATOS'!$W$19=1,'Tablas Guyanas y Santa Elena'!H7,'Tablas Resto de Ecuador'!H7)","v":564},{"$f":"IF('INGRESO DE DATOS'!$W$19=1,'Tablas Guyanas y Santa Elena'!I7,'Tablas Resto de Ecuador'!I7)","v":333},null,{"$f":"K10*$T$4","v":3384},{"$f":"L10*$T$4","v":2948},{"$f":"M10*$T$4","v":2485},{"$f":"N10*$T$4","v":1733},{"$f":"O10*$T$4","v":964},{"$f":"P10*$T$4","v":564},{"$f":"Q10*$T$4","v":333}]
[20,null,3442,2996,2485,1738,974,574,341,null,{"$f":"IF('INGRESO DE DATOS'!$W$19=1,'Tablas Guyanas y Santa Elena'!C8,'Tablas Resto de Ecuador'!C8)","v":3442},{"$f":"IF('INGRESO DE DATOS'!$W$19=1,'Tablas Guyanas y Santa Elena'!D8,'Tablas Resto de Ecuador'!D8)","v":2996},{"$f":"IF('INGRESO DE DATOS'!$W$19=1,'Tablas Guyanas y Santa Elena'!E8,'Tablas Resto de Ecuador'!E8)","v":2485},{"$f":"IF('INGRESO DE DATOS'!$W$19=1,'Tablas Guyanas y Santa Elena'!F8,'Tablas Resto de Ecuador'!F8)","v":1738},{"$f":"IF('INGRESO DE DATOS'!$W$19=1,'Tablas Guyanas y Santa Elena'!G8,'Tablas Resto de Ecuador'!G8)","v":974},{"$f":"IF('INGRESO DE DATOS'!$W$19=1,'Tablas Guyanas y Santa Elena'!H8,'Tablas Resto de Ecuador'!H8)","v":574},{"$f":"IF('INGRESO DE DATOS'!$W$19=1,'Tablas Guyanas y Santa Elena'!I8,'Tablas Resto de Ecuador'!I8)","v":341},null,3442,2996,2485,1738,974,574,341]
[21,null,3506,3050,2485,1746,984,585,348,null,{"$f":"IF('INGRESO DE DATOS'!$W$19=1,'Tablas Guyanas y Santa Elena'!C9,'Tablas Resto de Ecuador'!C9)","v":3506},{"$f":"IF('INGRESO DE DATOS'!$W$19=1,'Tablas Guyanas y Santa Elena'!D9,'Tablas Resto de Ecuador'!D9)","v":3050},{"$f":"IF('INGRESO DE DATOS'!$W$19=1,'Tablas Guyanas y Santa Elena'!E9,'Tablas Resto de Ecuador'!E9)","v":2485},{"$f":"IF('INGRESO DE DATOS'!$W$19=1,'Tablas Guyanas y Santa Elena'!F9,'Tablas Resto de Ecuador'!F9)","v":1746},{"$f":"IF('INGRESO DE DATOS'!$W$19=1,'Tablas Guyanas y Santa Elena'!G9,'Tablas Resto de Ecuador'!G9)","v":984},{"$f":"IF('INGRESO DE DATOS'!$W$19=1,'Tablas Guyanas y Santa Elena'!H9,'Tablas Resto de Ecuador'!H9)","v":585},{"$f":"IF('INGRESO DE DATOS'!$W$19=1,'Tablas Guyanas y Santa Elena'!I9,'Tablas Resto de Ecuador'!I9)","v":348},null,3506,3050,2485,1746,984,585,348]
[22,null,3565,3099,2492,1759,999,594,357,null,{"$f":"IF('INGRESO DE DATOS'!$W$19=1,'Tablas Guyanas y Santa Elena'!C10,'Tablas Resto de Ecuador'!C10)","v":3565},{"$f":"IF('INGRESO DE DATOS'!$W$19=1,'Tablas Guyanas y Santa Elena'!D10,'Tablas Resto de Ecuador'!D10)","v":3099},{"$f":"IF('INGRESO DE DATOS'!$W$19=1,'Tablas Guyanas y Santa Elena'!E10,'Tablas Resto de Ecuador'!E10)","v":2492},{"$f":"IF('INGRESO DE DATOS'!$W$19=1,'Tablas Guyanas y Santa Elena'!F10,'Tablas Resto de Ecuador'!F10)","v":1759},{"$f":"IF('INGRESO DE DATOS'!$W$19=1,'Tablas Guyanas y Santa Elena'!G10,'Tablas Resto de Ecuador'!G10)","v":999},{"$f":"IF('INGRESO DE DATOS'!$W$19=1,'Tablas Guyanas y Santa Elena'!H10,'Tablas Resto de Ecuador'!H10)","v":594},{"$f":"IF('INGRESO DE DATOS'!$W$19=1,'Tablas Guyanas y Santa Elena'!I10,'Tablas Resto de Ecuador'!I10)","v":357},null,3565,3099,2492,1759,999,594,357]
[23,null,3623,3149,2504,1774,1015,607,368,null,{"$f":"IF('INGRESO DE DATOS'!$W$19=1,'Tablas Guyanas y Santa Elena'!C11,'Tablas Resto de Ecuador'!C11)","v":3623},{"$f":"IF('INGRESO DE DATOS'!$W$19=1,'Tablas Guyanas y Santa Elena'!D11,'Tablas Resto de Ecuador'!D11)","v":3149},{"$f":"IF('INGRESO DE DATOS'!$W$19=1,'Tablas Guyanas y Santa Elena'!E11,'Tablas Resto de Ecuador'!E11)","v":2504},{"$f":"IF('INGRESO DE DATOS'!$W$19=1,'Tablas Guyanas y Santa Elena'!F11,'Tablas Resto de Ecuador'!F11)","v":1774},{"$f":"IF('INGRESO DE DATOS'!$W$19=1,'Tablas Guyanas y Santa Elena'!G11,'Tablas Resto de Ecuador'!G11)","v":1015},{"$f":"IF('INGRESO DE DATOS'!$W$19=1,'Tablas Guyanas y Santa Elena'!H11,'Tablas Resto de Ecuador'!H11)","v":607},{"$f":"IF('INGRESO DE DATOS'!$W$19=1,'Tablas Guyanas y Santa Elena'!I11,'Tablas Resto de Ecuador'!I11)","v":368},null,3623,3149,2504,1774,1015,607,368]
[24,null,3682,3200,2524,1796,1032,623,380,null,{"$f":"IF('INGRESO DE DATOS'!$W$19=1,'Tablas Guyanas y Santa Elena'!C12,'Tablas Resto de Ecuador'!C12)","v":3682},{"$f":"IF('INGRESO DE DATOS'!$W$19=1,'Tablas Guyanas y Santa Elena'!D12,'Tablas Resto de Ecuador'!D12)","v":3200},{"$f":"IF('INGRESO DE DATOS'!$W$19=1,'Tablas Guyanas y Santa Elena'!E12,'Tablas Resto de Ecuador'!E12)","v":2524},{"$f":"IF('INGRESO DE DATOS'!$W$19=1,'Tablas Guyanas y Santa Elena'!F12,'Tablas Resto de Ecuador'!F12)","v":1796},{"$f":"IF('INGRESO DE DATOS'!$W$19=1,'Tablas Guyanas y Santa Elena'!G12,'Tablas Resto de Ecuador'!G12)","v":1032},{"$f":"IF('INGRESO DE DATOS'!$W$19=1,'Tablas Guyanas y Santa Elena'!H12,'Tablas Resto de Ecuador'!H12)","v":623},{"$f":"IF('INGRESO DE DATOS'!$W$19=1,'Tablas Guyanas y Santa Elena'!I12,'Tablas Resto de Ecuador'!I12)","v":380},null,3682,3200,2524,1796,1032,623,380]
[25,null,3739,3256,2548,1820,1053,638,391,null,{"$f":"IF('INGRESO DE DATOS'!$W$19=1,'Tablas Guyanas y Santa Elena'!C13,'Tablas Resto de Ecuador'!C13)","v":3739},{"$f":"IF('INGRESO DE DATOS'!$W$19=1,'Tablas Guyanas y Santa Elena'!D13,'Tablas Resto de Ecuador'!D13)","v":3256},{"$f":"IF('INGRESO DE DATOS'!$W$19=1,'Tablas Guyanas y Santa Elena'!E13,'Tablas Resto de Ecuador'!E13)","v":2548},{"$f":"IF('INGRESO DE DATOS'!$W$19=1,'Tablas Guyanas y Santa Elena'!F13,'Tablas Resto de Ecuador'!F13)","v":1820},{"$f":"IF('INGRESO DE DATOS'!$W$19=1,'Tablas Guyanas y Santa Elena'!G13,'Tablas Resto de Ecuador'!G13)","v":1053},{"$f":"IF('INGRESO DE DATOS'!$W$19=1,'Tablas Guyanas y Santa Elena'!H13,'Tablas Resto de Ecuador'!H13)","v":638},{"$f":"IF('INGRESO DE DATOS'!$W$19=1,'Tablas Guyanas y Santa Elena'!I13,'Tablas Resto de Ecuador'!I13)","v":391},null,3739,3256,2548,1820,1053,638,391]
[26,null,3799,3304,2581,1851,1078,655,404,null,{"$f":"IF('INGRESO DE DATOS'!$W$19=1,'Tablas Guyanas y Santa Elena'!C14,'Tablas Resto de Ecuador'!C14)","v":3799},{"$f":"IF('INGRESO DE DATOS'!$W$19=1,'Tablas Guyanas y Santa Elena'!D14,'Tablas Resto de Ecuador'!D14)","v":3304},{"$f":"IF('INGRESO DE DATOS'!$W$19=1,'Tablas Guyanas y Santa Elena'!E14,'Tablas Resto de Ecuador'!E14)","v":2581},{"$f":"IF('INGRESO DE DATOS'!$W$19=1,'Tablas Guyanas y Santa Elena'!F14,'Tablas Resto de Ecuador'!F14)","v":1851},{"$f":"IF('INGRESO DE DATOS'!$W$19=1,'Tablas Guyanas y Santa Elena'!G14,'Tablas Resto de Ecuador'!G14)","v":1078},{"$f":"IF('INGRESO DE DATOS'!$W$19=1,'Tablas Guyanas y Santa Elena'!H14,'Tablas Resto de Ecuador'!H14)","v":655},{"$f":"IF('INGRESO DE DATOS'!$W$19=1,'Tablas Guyanas y Santa Elena'!I14,'Tablas Resto de Ecuador'!I14)","v":404},null,3799,3304,2581,1851,1078,655,404]
[27,null,3857,3353,2620,1887,1104,676,420,null,{"$f":"IF('INGRESO DE DATOS'!$W$19=1,'Tablas Guyanas y Santa Elena'!C15,'Tablas Resto de Ecuador'!C15)","v":3857},{"$f":"IF('INGRESO DE DATOS'!$W$19=1,'Tablas Guyanas y Santa Elena'!D15,'Tablas Resto de Ecuador'!D15)","v":3353},{"$f":"IF('INGRESO DE DATOS'!$W$19=1,'Tablas Guyanas y Santa Elena'!E15,'Tablas Resto de Ecuador'!E15)","v":2620},{"$f":"IF('INGRESO DE DATOS'!$W$19=1,'Tablas Guyanas y Santa Elena'!F15,'Tablas Resto de Ecuador'!F15)","v":1887},{"$f":"IF('INGRESO DE DATOS'!$W$19=1,'Tablas Guyanas y Santa Elena'!G15,'Tablas Resto de Ecuador'!G15)","v":1104},{"$f":"IF('INGRESO DE DATOS'!$W$19=1,'Tablas Guyanas y Santa Elena'!H15,'Tablas Resto de Ecuador'!H15)","v":676},{"$f":"IF('INGRESO DE DATOS'!$W$19=1,'Tablas Guyanas y Santa Elena'!I15,'Tablas Resto de Ecuador'!I15)","v":420},null,3857,3353,2620,1887,1104,676,420]
[28,null,3930,3412,2665,1927,1134,698,435,null,{"$f":"IF('INGRESO DE DATOS'!$W$19=1,'Tablas Guyanas y Santa Elena'!C16,'Tablas Resto de Ecuador'!C16)","v":3930},{"$f":"IF('INGRESO DE DATOS'!$W$19=1,'Tablas Guyanas y Santa Elena'!D16,'Tablas Resto de Ecuador'!D16)","v":3412},{"$f":"IF('INGRESO DE DATOS'!$W$19=1,'Tablas Guyanas y Santa Elena'!E16,'Tablas Resto de Ecuador'!E16)","v":2665},{"$f":"IF('INGRESO DE DATOS'!$W$19=1,'Tablas Guyanas y Santa Elena'!F16,'Tablas Resto de Ecuador'!F16)","v":1927},{"$f":"IF('INGRESO DE DATOS'!$W$19=1,'Tablas Guyanas y Santa Elena'!G16,'Tablas Resto de Ecuador'!G16)","v":1134},{"$f":"IF('INGRESO DE DATOS'!$W$19=1,'Tablas Guyanas y Santa Elena'!H16,'Tablas Resto de Ecuador'!H16)","v":698},{"$f":"IF('INGRESO DE DATOS'!$W$19=1,'Tablas Guyanas y Santa Elena'!I16,'Tablas Resto de Ecuador'!I16)","v":435},null,3930,3412,2665,1927,1134,698,435]
[29,null,3998,3480,2717,1973,1169,721,452,null,{"$f":"IF('INGRESO DE DATOS'!$W$19=1,'Tablas Guyanas y Santa Elena'!C17,'Tablas Resto de Ecuador'!C17)","v":3998},{"$f":"IF('INGRESO DE DATOS'!$W$19=1,'Tablas Guyanas y Santa Elena'!D17,'Tablas Resto de Ecuador'!D17)","v":3480},{"$f":"IF('INGRESO DE DATOS'!$W$19=1,'Tablas Guyanas y Santa Elena'!E17,'Tablas Resto de Ecuador'!E17)","v":2717},{"$f":"IF('INGRESO DE DATOS'!$W$19=1,'Tablas Guyanas y Santa Elena'!F17,'Tablas Resto de Ecuador'!F17)","v":1973},{"$f":"IF('INGRESO DE DATOS'!$W$19=1,'Tablas Guyanas y Santa Elena'!G17,'Tablas Resto de Ecuador'!G17)","v":1169},{"$f":"IF('INGRESO DE DATOS'!$W$19=1,'Tablas Guyanas y Santa Elena'!H17,'Tablas Resto de Ecuador'!H17)","v":721},{"$f":"IF('INGRESO DE DATOS'!$W$19=1,'Tablas Guyanas y Santa Elena'!I17,'Tablas Resto de Ecuador'!I17)","v":452},null,3998,3480,2717,1973,1169,721,452]
[30,null,4068,3540,2780,2023,1203,749,471,null,{"$f":"IF('INGRESO DE DATOS'!$W$19=1,'Tablas Guyanas y Santa Elena'!C18,'Tablas Resto de Ecuador'!C18)","v":4068},{"$f":"IF('INGRESO DE DATOS'!$W$19=1,'Tablas Guyanas y Santa Elena'!D18,'Tablas Resto de Ecuador'!D18)","v":3540},{"$f":"IF('INGRESO DE DATOS'!$W$19=1,'Tablas Guyanas y Santa Elena'!E18,'Tablas Resto de Ecuador'!E18)","v":2780},{"$f":"IF('INGRESO DE DATOS'!$W$19=1,'Tablas Guyanas y Santa Elena'!F18,'Tablas Resto de Ecuador'!F18)","v":2023},{"$f":"IF('INGRESO DE DATOS'!$W$19=1,'Tablas Guyanas y Santa Elena'!G18,'Tablas Resto de Ecuador'!G18)","v":1203},{"$f":"IF('INGRESO DE DATOS'!$W$19=1,'Tablas Guyanas y Santa Elena'!H18,'Tablas Resto de Ecuador'!H18)","v":749},{"$f":"IF('INGRESO DE DATOS'!$W$19=1,'Tablas Guyanas y Santa Elena'!I18,'Tablas Resto de Ecuador'!I18)","v":471},null,4068,3540,2780,2023,1203,749,471]
[31,null,4136,3599,2847,2081,1243,778,494,null,{"$f":"IF('INGRESO DE DATOS'!$W$19=1,'Tablas Guyanas y Santa Elena'!C19,'Tablas Resto de Ecuador'!C19)","v":4136},{"$f":"IF('INGRESO DE DATOS'!$W$19=1,'Tablas Guyanas y Santa Elena'!D19,'Tablas Resto de Ecuador'!D19)","v":3599},{"$f":"IF('INGRESO DE DATOS'!$W$19=1,'Tablas Guyanas y Santa Elena'!E19,'Tablas Resto de Ecuador'!E19)","v":2847},{"$f":"IF('INGRESO DE DATOS'!$W$19=1,'Tablas Guyanas y Santa Elena'!F19,'Tablas Resto de Ecuador'!F19)","v":2081},{"$f":"IF('INGRESO DE DATOS'!$W$19=1,'Tablas Guyanas y Santa Elena'!G19,'Tablas Resto de Ecuador'!G19)","v":1243},{"$f":"IF('INGRESO DE DATOS'!$W$19=1,'Tablas Guyanas y Santa Elena'!H19,'Tablas Resto de Ecuador'!H19)","v":778},{"$f":"IF('INGRESO DE DATOS'!$W$19=1,'Tablas Guyanas y Santa Elena'!I19,'Tablas Resto de Ecuador'!I19)","v":494},null,4136,3599,2847,2081,1243,778,494]
[32,null,4208,3656,2924,2144,1289,808,516,null,{"$f":"IF('INGRESO DE DATOS'!$W$19=1,'Tablas Guyanas y Santa Elena'!C20,'Tablas Resto de Ecuador'!C20)","v":4208},{"$f":"IF('INGRESO DE DATOS'!$W$19=1,'Tablas Guyanas y Santa Elena'!D20,'Tablas Resto de Ecuador'!D20)","v":3656},{"$f":"IF('INGRESO DE DATOS'!$W$19=1,'Tablas Guyanas y Santa Elena'!E20,'Tablas Resto de Ecuador'!E20)","v":2924},{"$f":"IF('INGRESO DE DATOS'!$W$19=1,'Tablas Guyanas y Santa Elena'!F20,'Tablas Resto de Ecuador'!F20)","v":2144},{"$f":"IF('INGRESO DE DATOS'!$W$19=1,'Tablas Guyanas y Santa Elena'!G20,'Tablas Resto de Ecuador'!G20)","v":1289},{"$f":"IF('INGRESO DE DATOS'!$W$19=1,'Tablas Guyanas y Santa Elena'!H20,'Tablas Resto de Ecuador'!H20)","v":808},{"$f":"IF('INGRESO DE DATOS'!$W$19=1,'Tablas Guyanas y Santa Elena'!I20,'Tablas Resto de Ecuador'!I20)","v":516},null,4208,3656,2924,2144,1289,808,516]
[33,null,4322,3761,3009,2212,1337,844,541,null,{"$f":"IF('INGRESO DE DATOS'!$W$19=1,'Tablas Guyanas y Santa Elena'!C21,'Tablas Resto de Ecuador'!C21)","v":4322},{"$f":"IF('INGRESO DE DATOS'!$W$19=1,'Tablas Guyanas y Santa Elena'!D21,'Tablas Resto de Ecuador'!D21)","v":3761},{"$f":"IF('INGRESO DE DATOS'!$W$19=1,'Tablas Guyanas y Santa Elena'!E21,'Tablas Resto de Ecuador'!E21)","v":3009},{"$f":"IF('INGRESO DE DATOS'!$W$19=1,'Tablas Guyanas y Santa Elena'!F21,'Tablas Resto de Ecuador'!F21)","v":2212},{"$f":"IF('INGRESO DE DATOS'!$W$19=1,'Tablas Guyanas y Santa Elena'!G21,'Tablas Resto de Ecuador'!G21)","v":1337},{"$f":"IF('INGRESO DE DATOS'!$W$19=1,'Tablas Guyanas y Santa Elena'!H21,'Tablas Resto de Ecuador'!H21)","v":844},{"$f":"IF('INGRESO DE DATOS'!$W$19=1,'Tablas Guyanas y Santa Elena'!I21,'Tablas Resto de Ecuador'!I21)","v":541},null,4322,3761,3009,2212,1337,844,541]
[34,null,4437,3857,3105,2290,1392,880,569,null,{"$f":"IF('INGRESO DE DATOS'!$W$19=1,'Tablas Guyanas y Santa Elena'!C22,'Tablas Resto de Ecuador'!C22)","v":4437},{"$f":"IF('INGRESO DE DATOS'!$W$19=1,'Tablas Guyanas y Santa Elena'!D22,'Tablas Resto de Ecuador'!D22)","v":3857},{"$f":"IF('INGRESO DE DATOS'!$W$19=1,'Tablas Guyanas y Santa Elena'!E22,'Tablas Resto de Ecuador'!E22)","v":3105},{"$f":"IF('INGRESO DE DATOS'!$W$19=1,'Tablas Guyanas y Santa Elena'!F22,'Tablas Resto de Ecuador'!F22)","v":2290},{"$f":"IF('INGRESO DE DATOS'!$W$19=1,'Tablas Guyanas y Santa Elena'!G22,'Tablas Resto de Ecuador'!G22)","v":1392},{"$f":"IF('INGRESO DE DATOS'!$W$19=1,'Tablas Guyanas y Santa Elena'!H22,'Tablas Resto de Ecuador'!H22)","v":880},{"$f":"IF('INGRESO DE DATOS'!$W$19=1,'Tablas Guyanas y Santa Elena'!I22,'Tablas Resto de Ecuador'!I22)","v":569},null,4437,3857,3105,2290,1392,880,569]
[35,null,4551,3959,3208,2375,1449,922,598,null,{"$f":"IF('INGRESO DE DATOS'!$W$19=1,'Tablas Guyanas y Santa Elena'!C23,'Tablas Resto de Ecuador'!C23)","v":4551},{"$f":"IF('INGRESO DE DATOS'!$W$19=1,'Tablas Guyanas y Santa Elena'!D23,'Tablas Resto de Ecuador'!D23)","v":3959},{"$f":"IF('INGRESO DE DATOS'!$W$19=1,'Tablas Guyanas y Santa Elena'!E23,'Tablas Resto de Ecuador'!E23)","v":3208},{"$f":"IF('INGRESO DE DATOS'!$W$19=1,'Tablas Guyanas y Santa Elena'!F23,'Tablas Resto de Ecuador'!F23)","v":2375},{"$f":"IF('INGRESO DE DATOS'!$W$19=1,'Tablas Guyanas y Santa Elena'!G23,'Tablas Resto de Ecuador'!G23)","v":1449},{"$f":"IF('INGRESO DE DATOS'!$W$19=1,'Tablas Guyanas y Santa Elena'!H23,'Tablas Resto de Ecuador'!H23)","v":922},{"$f":"IF('INGRESO DE DATOS'!$W$19=1,'Tablas Guyanas y Santa Elena'!I23,'Tablas Resto de Ecuador'!I23)","v":598},null,4551,3959,3208,2375,1449,922,598]
[36,null,4665,4058,3324,2467,1512,966,632,null,{"$f":"IF('INGRESO DE DATOS'!$W$19=1,'Tablas Guyanas y Santa Elena'!C24,'Tablas Resto de Ecuador'!C24)","v":4665},{"$f":"IF('INGRESO DE DATOS'!$W$19=1,'Tablas Guyanas y Santa Elena'!D24,'Tablas Resto de Ecuador'!D24)","v":4058},{"$f":"IF('INGRESO DE DATOS'!$W$19=1,'Tablas Guyanas y Santa Elena'!E24,'Tablas Resto de Ecuador'!E24)","v":3324},{"$f":"IF('INGRESO DE DATOS'!$W$19=1,'Tablas Guyanas y Santa Elena'!F24,'Tablas Resto de Ecuador'!F24)","v":2467},{"$f":"IF('INGRESO DE DATOS'!$W$19=1,'Tablas Guyanas y Santa Elena'!G24,'Tablas Resto de Ecuador'!G24)","v":1512},{"$f":"IF('INGRESO DE DATOS'!$W$19=1,'Tablas Guyanas y Santa Elena'!H24,'Tablas Resto de Ecuador'!H24)","v":966},{"$f":"IF('INGRESO DE DATOS'!$W$19=1,'Tablas Guyanas y Santa Elena'!I24,'Tablas Resto de Ecuador'!I24)","v":632},null,4665,4058,3324,2467,1512,966,632]
[37,null,4783,4161,3448,2569,1583,1015,666,null,{"$f":"IF('INGRESO DE DATOS'!$W$19=1,'Tablas Guyanas y Santa Elena'!C25,'Tablas Resto de Ecuador'!C25)","v":4783},{"$f":"IF('INGRESO DE DATOS'!$W$19=1,'Tablas Guyanas y Santa Elena'!D25,'Tablas Resto de Ecuador'!D25)","v":4161},{"$f":"IF('INGRESO DE DATOS'!$W$19=1,'Tablas Guyanas y Santa Elena'!E25,'Tablas Resto de Ecuador'!E25)","v":3448},{"$f":"IF('INGRESO DE DATOS'!$W$19=1,'Tablas Guyanas y Santa Elena'!F25,'Tablas Resto de Ecuador'!F25)","v":2569},{"$f":"IF('INGRESO DE DATOS'!$W$19=1,'Tablas Guyanas y Santa Elena'!G25,'Tablas Resto de Ecuador'!G25)","v":1583},{"$f":"IF('INGRESO DE DATOS'!$W$19=1,'Tablas Guyanas y Santa Elena'!H25,'Tablas Resto de Ecuador'!H25)","v":1015},{"$f":"IF('INGRESO DE DATOS'!$W$19=1,'Tablas Guyanas y Santa Elena'!I25,'Tablas Resto de Ecuador'!I25)","v":666},null,4783,4161,3448,2569,1583,1015,666]
[38,null,4901,4265,3585,2678,1657,1067,705,null,{"$f":"IF('INGRESO DE DATOS'!$W$19=1,'Tablas Guyanas y Santa Elena'!C26,'Tablas Resto de Ecuador'!C26)","v":4901},{"$f":"IF('INGRESO DE DATOS'!$W$19=1,'Tablas Guyanas y Santa Elena'!D26,'Tablas Resto de Ecuador'!D26)","v":4265},{"$f":"IF('INGRESO DE DATOS'!$W$19=1,'Tablas Guyanas y Santa Elena'!E26,'Tablas Resto de Ecuador'!E26)","v":3585},{"$f":"IF('INGRESO DE DATOS'!$W$19=1,'Tablas Guyanas y Santa Elena'!F26,'Tablas Resto de Ecuador'!F26)","v":2678},{"$f":"IF('INGRESO DE DATOS'!$W$19=1,'Tablas Guyanas y Santa Elena'!G26,'Tablas Resto de Ecuador'!G26)","v":1657},{"$f":"IF('INGRESO DE DATOS'!$W$19=1,'Tablas Guyanas y Santa Elena'!H26,'Tablas Resto de Ecuador'!H26)","v":1067},{"$f":"IF('INGRESO DE DATOS'!$W$19=1,'Tablas Guyanas y Santa Elena'!I26,'Tablas Resto de Ecuador'!I26)","v":705},null,4901,4265,3585,2678,1657,1067,705]
[39,null,5020,4362,3712,2796,1739,1125,747,null,{"$f":"IF('INGRESO DE DATOS'!$W$19=1,'Tablas Guyanas y Santa Elena'!C27,'Tablas Resto de Ecuador'!C27)","v":5020},{"$f":"IF('INGRESO DE DATOS'!$W$19=1,'Tablas Guyanas y Santa Elena'!D27,'Tablas Resto de Ecuador'!D27)","v":4362},{"$f":"IF('INGRESO DE DATOS'!$W$19=1,'Tablas Guyanas y Santa Elena'!E27,'Tablas Resto de Ecuador'!E27)","v":3712},{"$f":"IF('INGRESO DE DATOS'!$W$19=1,'Tablas Guyanas y Santa Elena'!F27,'Tablas Resto de Ecuador'!F27)","v":2796},{"$f":"IF('INGRESO DE DATOS'!$W$19=1,'Tablas Guyanas y Santa Elena'!G27,'Tablas Resto de Ecuador'!G27)","v":1739},{"$f":"IF('INGRESO DE DATOS'!$W$19=1,'Tablas Guyanas y Santa Elena'!H27,'Tablas Resto de Ecuador'!H27)","v":1125},{"$f":"IF('INGRESO DE DATOS'!$W$19=1,'Tablas Guyanas y Santa Elena'!I27,'Tablas Resto de Ecuador'!I27)","v":747},null,5020,4362,3712,2796,1739,1125,747]
[40,null,5137,4465,3752,2926,1829,1187,792,null,{"$f":"IF('INGRESO DE DATOS'!$W$19=1,'Tablas Guyanas y Santa Elena'!C28,'Tablas Resto de Ecuador'!C28)","v":5137},{"$f":"IF('INGRESO DE DATOS'!$W$19=1,'Tablas Guyanas y Santa Elena'!D28,'Tablas Resto de Ecuador'!D28)","v":4465},{"$f":"IF('INGRESO DE DATOS'!$W$19=1,'Tablas Guyanas y Santa Elena'!E28,'Tablas Resto de Ecuador'!E28)","v":3752},{"$f":"IF('INGRESO DE DATOS'!$W$19=1,'Tablas Guyanas y Santa Elena'!F28,'Tablas Resto de Ecuador'!F28)","v":2926},{"$f":"IF('INGRESO DE DATOS'!$W$19=1,'Tablas Guyanas y Santa Elena'!G28,'Tablas Resto de Ecuador'!G28)","v":1829},{"$f":"IF('INGRESO DE DATOS'!$W$19=1,'Tablas Guyanas y Santa Elena'!H28,'Tablas Resto de Ecuador'!H28)","v":1187},{"$f":"IF('INGRESO DE DATOS'!$W$19=1,'Tablas Guyanas y Santa Elena'!I28,'Tablas Resto de Ecuador'!I28)","v":792},null,5137,4465,3752,2926,1829,1187,792]
[41,null,5251,4569,3791,3067,1924,1254,841,null,{"$f":"IF('INGRESO DE DATOS'!$W$19=1,'Tablas Guyanas y Santa Elena'!C29,'Tablas Resto de Ecuador'!C29)","v":5251},{"$f":"IF('INGRESO DE DATOS'!$W$19=1,'Tablas Guyanas y Santa Elena'!D29,'Tablas Resto de Ecuador'!D29)","v":4569},{"$f":"IF('INGRESO DE DATOS'!$W$19=1,'Tablas Guyanas y Santa Elena'!E29,'Tablas Resto de Ecuador'!E29)","v":3791},{"$f":"IF('INGRESO DE DATOS'!$W$19=1,'Tablas Guyanas y Santa Elena'!F29,'Tablas Resto de Ecuador'!F29)","v":3067},{"$f":"IF('INGRESO DE DATOS'!$W$19=1,'Tablas Guyanas y Santa Elena'!G29,'Tablas Resto de Ecuador'!G29)","v":1924},{"$f":"IF('INGRESO DE DATOS'!$W$19=1,'Tablas Guyanas y Santa Elena'!H29,'Tablas Resto de Ecuador'!H29)","v":1254},{"$f":"IF('INGRESO DE DATOS'!$W$19=1,'Tablas Guyanas y Santa Elena'!I29,'Tablas Resto de Ecuador'!I29)","v":841},null,5251,4569,3791,3067,1924,1254,841]
[42,null,5373,4668,3845,3221,2028,1328,895,null,{"$f":"IF('INGRESO DE DATOS'!$W$19=1,'Tablas Guyanas y Santa Elena'!C30,'Tablas Resto de Ecuador'!C30)","v":5373},{"$f":"IF('INGRESO DE DATOS'!$W$19=1,'Tablas Guyanas y Santa Elena'!D30,'Tablas Resto de Ecuador'!D30)","v":4668},{"$f":"IF('INGRESO DE DATOS'!$W$19=1,'Tablas Guyanas y Santa Elena'!E30,'Tablas Resto de Ecuador'!E30)","v":3845},{"$f":"IF('INGRESO DE DATOS'!$W$19=1,'Tablas Guyanas y Santa Elena'!F30,'Tablas Resto de Ecuador'!F30)","v":3221},{"$f":"IF('INGRESO DE DATOS'!$W$19=1,'Tablas Guyanas y Santa Elena'!G30,'Tablas Resto de Ecuador'!G30)","v":2028},{"$f":"IF('INGRESO DE DATOS'!$W$19=1,'Tablas Guyanas y Santa Elena'!H30,'Tablas Resto de Ecuador'!H30)","v":1328},{"$f":"IF('INGRESO DE DATOS'!$W$19=1,'Tablas Guyanas y Santa Elena'!I30,'Tablas Resto de Ecuador'!I30)","v":895},null,5373,4668,3845,3221,2028,1328,895]
[43,null,5581,4855,3931,3385,2141,1408,954,null,{"$f":"IF('INGRESO DE DATOS'!$W$19=1,'Tablas Guyanas y Santa Elena'!C31,'Tablas Resto de Ecuador'!C31)","v":5581},{"$f":"IF('INGRESO DE DATOS'!$W$19=1,'Tablas Guyanas y Santa Elena'!D31,'Tablas Resto de Ecuador'!D31)","v":4855},{"$f":"IF('INGRESO DE DATOS'!$W$19=1,'Tablas Guyanas y Santa Elena'!E31,'Tablas Resto de Ecuador'!E31)","v":3931},{"$f":"IF('INGRESO DE DATOS'!$W$19=1,'Tablas Guyanas y Santa Elena'!F31,'Tablas Resto de Ecuador'!F31)","v":3385},{"$f":"IF('INGRESO DE DATOS'!$W$19=1,'Tablas Guyanas y Santa Elena'!G31,'Tablas Resto de Ecuador'!G31)","v":2141},{"$f":"IF('INGRESO DE DATOS'!$W$19=1,'Tablas Guyanas y Santa Elena'!H31,'Tablas Resto de Ecuador'!H31)","v":1408},{"$f":"IF('INGRESO DE DATOS'!$W$19=1,'Tablas Guyanas y Santa Elena'!I31,'Tablas Resto de Ecuador'!I31)","v":954},null,5581,4855,3931,3385,2141,1408,954]
[44,null,5797,5042,4051,3565,2264,1493,1017,null,{"$f":"IF('INGRESO DE DATOS'!$W$19=1,'Tablas Guyanas y Santa Elena'!C32,'Tablas Resto de Ecuador'!C32)","v":5797},{"$f":"IF('INGRESO DE DATOS'!$W$19=1,'Tablas Guyanas y Santa Elena'!D32,'Tablas Resto de Ecuador'!D32)","v":5042},{"$f":"IF('INGRESO DE DATOS'!$W$19=1,'Tablas Guyanas y Santa Elena'!E32,'Tablas Resto de Ecuador'!E32)","v":4051},{"$f":"IF('INGRESO DE DATOS'!$W$19=1,'Tablas Guyanas y Santa Elena'!F32,'Tablas Resto de Ecuador'!F32)","v":3565},{"$f":"IF('INGRESO DE DATOS'!$W$19=1,'Tablas Guyanas y Santa Elena'!G32,'Tablas Resto de Ecuador'!G32)","v":2264},{"$f":"IF('INGRESO DE DATOS'!$W$19=1,'Tablas Guyanas y Santa Elena'!H32,'Tablas Resto de Ecuador'!H32)","v":1493},{"$f":"IF('INGRESO DE DATOS'!$W$19=1,'Tablas Guyanas y Santa Elena'!I32,'Tablas Resto de Ecuador'!I32)","v":1017},null,5797,5042,4051,3565,2264,1493,1017]
[45,null,6010,5224,4195,3757,2395,1586,1086,null,{"$f":"IF('INGRESO DE DATOS'!$W$19=1,'Tablas Guyanas y Santa Elena'!C33,'Tablas Resto de Ecuador'!C33)","v":6010},{"$f":"IF('INGRESO DE DATOS'!$W$19=1,'Tablas Guyanas y Santa Elena'!D33,'Tablas Resto de Ecuador'!D33)","v":5224},{"$f":"IF('INGRESO DE DATOS'!$W$19=1,'Tablas Guyanas y Santa Elena'!E33,'Tablas Resto de Ecuador'!E33)","v":4195},{"$f":"IF('INGRESO DE DATOS'!$W$19=1,'Tablas Guyanas y Santa Elena'!F33,'Tablas Resto de Ecuador'!F33)","v":3757},{"$f":"IF('INGRESO DE DATOS'!$W$19=1,'Tablas Guyanas y Santa Elena'!G33,'Tablas Resto de Ecuador'!G33)","v":2395},{"$f":"IF('INGRESO DE DATOS'!$W$19=1,'Tablas Guyanas y Santa Elena'!H33,'Tablas Resto de Ecuador'!H33)","v":1586},{"$f":"IF('INGRESO DE DATOS'!$W$19=1,'Tablas Guyanas y Santa Elena'!I33,'Tablas Resto de Ecuador'!I33)","v":1086},null,6010,5224,4195,3757,2395,1586,1086]
[46,null,6222,5410,4358,3903,2538,1688,1162,null,{"$f":"IF('INGRESO DE DATOS'!$W$19=1,'Tablas Guyanas y Santa Elena'!C34,'Tablas Resto de Ecuador'!C34)","v":6222},{"$f":"IF('INGRESO DE DATOS'!$W$19=1,'Tablas Guyanas y Santa Elena'!D34,'Tablas Resto de Ecuador'!D34)","v":5410},{"$f":"IF('INGRESO DE DATOS'!$W$19=1,'Tablas Guyanas y Santa Elena'!E34,'Tablas Resto de Ecuador'!E34)","v":4358},{"$f":"IF('INGRESO DE DATOS'!$W$19=1,'Tablas Guyanas y Santa Elena'!F34,'Tablas Resto de Ecuador'!F34)","v":3903},{"$f":"IF('INGRESO DE DATOS'!$W$19=1,'Tablas Guyanas y Santa Elena'!G34,'Tablas Resto de Ecuador'!G34)","v":2538},{"$f":"IF('INGRESO DE DATOS'!$W$19=1,'Tablas Guyanas y Santa Elena'!H34,'Tablas Resto de Ecuador'!H34)","v":1688},{"$f":"IF('INGRESO DE DATOS'!$W$19=1,'Tablas Guyanas y Santa Elena'!I34,'Tablas Resto de Ecuador'!I34)","v":1162},null,6222,5410,4358,3903,2538,1688,1162]
[47,null,6439,5597,4535,3776,2693,1797,1242,null,{"$f":"IF('INGRESO DE DATOS'!$W$19=1,'Tablas Guyanas y Santa Elena'!C35,'Tablas Resto de Ecuador'!C35)","v":6439},{"$f":"IF('INGRESO DE DATOS'!$W$19=1,'Tablas Guyanas y Santa Elena'!D35,'Tablas Resto de Ecuador'!D35)","v":5597},{"$f":"IF('INGRESO DE DATOS'!$W$19=1,'Tablas Guyanas y Santa Elena'!E35,'Tablas Resto de Ecuador'!E35)","v":4535},{"$f":"IF('INGRESO DE DATOS'!$W$19=1,'Tablas Guyanas y Santa Elena'!F35,'Tablas Resto de Ecuador'!F35)","v":3776},{"$f":"IF('INGRESO DE DATOS'!$W$19=1,'Tablas Guyanas y Santa Elena'!G35,'Tablas Resto de Ecuador'!G35)","v":2693},{"$f":"IF('INGRESO DE DATOS'!$W$19=1,'Tablas Guyanas y Santa Elena'!H35,'Tablas Resto de Ecuador'!H35)","v":1797},{"$f":"IF('INGRESO DE DATOS'!$W$19=1,'Tablas Guyanas y Santa Elena'!I35,'Tablas Resto de Ecuador'!I35)","v":1242},null,6439,5597,4535,3776,2693,1797,1242]
[48,null,6667,5795,4723,3764,2862,1916,1331,null,{"$f":"IF('INGRESO DE DATOS'!$W$19=1,'Tablas Guyanas y Santa Elena'!C36,'Tablas Resto de Ecuador'!C36)","v":6667},{"$f":"IF('INGRESO DE DATOS'!$W$19=1,'Tablas Guyanas y Santa Elena'!D36,'Tablas Resto de Ecuador'!D36)","v":5795},{"$f":"IF('INGRESO DE DATOS'!$W$19=1,'Tablas Guyanas y Santa Elena'!E36,'Tablas Resto de Ecuador'!E36)","v":4723},{"$f":"IF('INGRESO DE DATOS'!$W$19=1,'Tablas Guyanas y Santa Elena'!F36,'Tablas Resto de Ecuador'!F36)","v":3764},{"$f":"IF('INGRESO DE DATOS'!$W$19=1,'Tablas Guyanas y Santa Elena'!G36,'Tablas Resto de Ecuador'!G36)","v":2862},{"$f":"IF('INGRESO DE DATOS'!$W$19=1,'Tablas Guyanas y Santa Elena'!H36,'Tablas Resto de Ecuador'!H36)","v":1916},{"$f":"IF('INGRESO DE DATOS'!$W$19=1,'Tablas Guyanas y Santa Elena'!I36,'Tablas Resto de Ecuador'!I36)","v":1331},null,6667,5795,4723,3764,2862,1916,1331]
[49,null,6890,5993,4920,3896,3043,2044,1428,null,{"$f":"IF('INGRESO DE DATOS'!$W$19=1,'Tablas Guyanas y Santa Elena'!C37,'Tablas Resto de Ecuador'!C37)","v":6890},{"$f":"IF('INGRESO DE DATOS'!$W$19=1,'Tablas Guyanas y Santa Elena'!D37,'Tablas Resto de Ecuador'!D37)","v":5993},{"$f":"IF('INGRESO DE DATOS'!$W$19=1,'Tablas Guyanas y Santa Elena'!E37,'Tablas Resto de Ecuador'!E37)","v":4920},{"$f":"IF('INGRESO DE DATOS'!$W$19=1,'Tablas Guyanas y Santa Elena'!F37,'Tablas Resto de Ecuador'!F37)","v":3896},{"$f":"IF('INGRESO DE DATOS'!$W$19=1,'Tablas Guyanas y Santa Elena'!G37,'Tablas Resto de Ecuador'!G37)","v":3043},{"$f":"IF('INGRESO DE DATOS'!$W$19=1,'Tablas Guyanas y Santa Elena'!H37,'Tablas Resto de Ecuador'!H37)","v":2044},{"$f":"IF('INGRESO DE DATOS'!$W$19=1,'Tablas Guyanas y Santa Elena'!I37,'Tablas Resto de Ecuador'!I37)","v":1428},null,6890,5993,4920,3896,3043,2044,1428]
[50,null,7114,6188,5132,4126,3146,2084,1539,null,{"$f":"IF('INGRESO DE DATOS'!$W$19=1,'Tablas Guyanas y Santa Elena'!C38,'Tablas Resto de Ecuador'!C38)","v":7114},{"$f":"IF('INGRESO DE DATOS'!$W$19=1,'Tablas Guyanas y Santa Elena'!D38,'Tablas Resto de Ecuador'!D38)","v":6188},{"$f":"IF('INGRESO DE DATOS'!$W$19=1,'Tablas Guyanas y Santa Elena'!E38,'Tablas Resto de Ecuador'!E38)","v":5132},{"$f":"IF('INGRESO DE DATOS'!$W$19=1,'Tablas Guyanas y Santa Elena'!F38,'Tablas Resto de Ecuador'!F38)","v":4126},{"$f":"IF('INGRESO DE DATOS'!$W$19=1,'Tablas Guyanas y Santa Elena'!G38,'Tablas Resto de Ecuador'!G38)","v":3146},{"$f":"IF('INGRESO DE DATOS'!$W$19=1,'Tablas Guyanas y Santa Elena'!H38,'Tablas Resto de Ecuador'!H38)","v":2084},{"$f":"IF('INGRESO DE DATOS'!$W$19=1,'Tablas Guyanas y Santa Elena'!I38,'Tablas Resto de Ecuador'!I38)","v":1539},null,7114,6188,5132,4126,3146,2084,1539]
[51,null,7339,6257,5356,4412,3182,2259,1677,null,{"$f":"IF('INGRESO DE DATOS'!$W$19=1,'Tablas Guyanas y Santa Elena'!C39,'Tablas Resto de Ecuador'!C39)","v":7339},{"$f":"IF('INGRESO DE DATOS'!$W$19=1,'Tablas Guyanas y Santa Elena'!D39,'Tablas Resto de Ecuador'!D39)","v":6257},{"$f":"IF('INGRESO DE DATOS'!$W$19=1,'Tablas Guyanas y Santa Elena'!E39,'Tablas Resto de Ecuador'!E39)","v":5356},{"$f":"IF('INGRESO DE DATOS'!$W$19=1,'Tablas Guyanas y Santa Elena'!F39,'Tablas Resto de Ecuador'!F39)","v":4412},{"$f":"IF('INGRESO DE DATOS'!$W$19=1,'Tablas Guyanas y Santa Elena'!G39,'Tablas Resto de Ecuador'!G39)","v":3182},{"$f":"IF('INGRESO DE DATOS'!$W$19=1,'Tablas Guyanas y Santa Elena'!H39,'Tablas Resto de Ecuador'!H39)","v":2259},{"$f":"IF('INGRESO DE DATOS'!$W$19=1,'Tablas Guyanas y Santa Elena'!I39,'Tablas Resto de Ecuador'!I39)","v":1677},null,7339,6257,5356,4412,3182,2259,1677]
[52,null,7564,6191,5591,4710,3227,2446,1824,null,{"$f":"IF('INGRESO DE DATOS'!$W$19=1,'Tablas Guyanas y Santa Elena'!C40,'Tablas Resto de Ecuador'!C40)","v":7564},{"$f":"IF('INGRESO DE DATOS'!$W$19=1,'Tablas Guyanas y Santa Elena'!D40,'Tablas Resto de Ecuador'!D40)","v":6191},{"$f":"IF('INGRESO DE DATOS'!$W$19=1,'Tablas Guyanas y Santa Elena'!E40,'Tablas Resto de Ecuador'!E40)","v":5591},{"$f":"IF('INGRESO DE DATOS'!$W$19=1,'Tablas Guyanas y Santa Elena'!F40,'Tablas Resto de Ecuador'!F40)","v":4710},{"$f":"IF('INGRESO DE DATOS'!$W$19=1,'Tablas Guyanas y Santa Elena'!G40,'Tablas Resto de Ecuador'!G40)","v":3227},{"$f":"IF('INGRESO DE DATOS'!$W$19=1,'Tablas Guyanas y Santa Elena'!H40,'Tablas Resto de Ecuador'!H40)","v":2446},{"$f":"IF('INGRESO DE DATOS'!$W$19=1,'Tablas Guyanas y Santa Elena'!I40,'Tablas Resto de Ecuador'!I40)","v":1824},null,7564,6191,5591,4710,3227,2446,1824]
[53,null,7832,6267,5838,4977,3296,2548,1984,null,{"$f":"IF('INGRESO DE DATOS'!$W$19=1,'Tablas Guyanas y Santa Elena'!C41,'Tablas Resto de Ecuador'!C41)","v":7832},{"$f":"IF('INGRESO DE DATOS'!$W$19=1,'Tablas Guyanas y Santa Elena'!D41,'Tablas Resto de Ecuador'!D41)","v":6267},{"$f":"IF('INGRESO DE DATOS'!$W$19=1,'Tablas Guyanas y Santa Elena'!E41,'Tablas Resto de Ecuador'!E41)","v":5838},{"$f":"IF('INGRESO DE DATOS'!$W$19=1,'Tablas Guyanas y Santa Elena'!F41,'Tablas Resto de Ecuador'!F41)","v":4977},{"$f":"IF('INGRESO DE DATOS'!$W$19=1,'Tablas Guyanas y Santa Elena'!G41,'Tablas Resto de Ecuador'!G41)","v":3296},{"$f":"IF('INGRESO DE DATOS'!$W$19=1,'Tablas Guyanas y Santa Elena'!H41,'Tablas Resto de Ecuador'!H41)","v":2548},{"$f":"IF('INGRESO DE DATOS'!$W$19=1,'Tablas Guyanas y Santa Elena'!I41,'Tablas Resto de Ecuador'!I41)","v":1984},null,7832,6267,5838,4977,3296,2548,1984]
[54,null,8102,6513,6096,5205,3373,2755,2156,null,{"$f":"IF('INGRESO DE DATOS'!$W$19=1,'Tablas Guyanas y Santa Elena'!C42,'Tablas Resto de Ecuador'!C42)","v":8102},{"$f":"IF('INGRESO DE DATOS'!$W$19=1,'Tablas Guyanas y Santa Elena'!D42,'Tablas Resto de Ecuador'!D42)","v":6513},{"$f":"IF('INGRESO DE DATOS'!$W$19=1,'Tablas Guyanas y Santa Elena'!E42,'Tablas Resto de Ecuador'!E42)","v":6096},{"$f":"IF('INGRESO DE DATOS'!$W$19=1,'Tablas Guyanas y Santa Elena'!F42,'Tablas Resto de Ecuador'!F42)","v":5205},{"$f":"IF('INGRESO DE DATOS'!$W$19=1,'Tablas Guyanas y Santa Elena'!G42,'Tablas Resto de Ecuador'!G42)","v":3373},{"$f":"IF('INGRESO DE DATOS'!$W$19=1,'Tablas Guyanas y Santa Elena'!H42,'Tablas Resto de Ecuador'!H42)","v":2755},{"$f":"IF('INGRESO DE DATOS'!$W$19=1,'Tablas Guyanas y Santa Elena'!I42,'Tablas Resto de Ecuador'!I42)","v":2156},null,8102,6513,6096,5205,3373,2755,2156]
[55,null,8373,6878,6364,5424,3449,2978,2340,null,{"$f":"IF('INGRESO DE DATOS'!$W$19=1,'Tablas Guyanas y Santa Elena'!C43,'Tablas Resto de Ecuador'!C43)","v":8373},{"$f":"IF('INGRESO DE DATOS'!$W$19=1,'Tablas Guyanas y Santa Elena'!D43,'Tablas Resto de Ecuador'!D43)","v":6878},{"$f":"IF('INGRESO DE DATOS'!$W$19=1,'Tablas Guyanas y Santa Elena'!E43,'Tablas Resto de Ecuador'!E43)","v":6364},{"$f":"IF('INGRESO DE DATOS'!$W$19=1,'Tablas Guyanas y Santa Elena'!F43,'Tablas Resto de Ecuador'!F43)","v":5424},{"$f":"IF('INGRESO DE DATOS'!$W$19=1,'Tablas Guyanas y Santa Elena'!G43,'Tablas Resto de Ecuador'!G43)","v":3449},{"$f":"IF('INGRESO DE DATOS'!$W$19=1,'Tablas Guyanas y Santa Elena'!H43,'Tablas Resto de Ecuador'!H43)","v":2978},{"$f":"IF('INGRESO DE DATOS'!$W$19=1,'Tablas Guyanas y Santa Elena'!I43,'Tablas Resto de Ecuador'!I43)","v":2340},null,8373,6878,6364,5424,3449,2978,2340]
[56,null,8627,7318,6645,5644,3547,3095,2536,null,{"$f":"IF('INGRESO DE DATOS'!$W$19=1,'Tablas Guyanas y Santa Elena'!C44,'Tablas Resto de Ecuador'!C44)","v":8627},{"$f":"IF('INGRESO DE DATOS'!$W$19=1,'Tablas Guyanas y Santa Elena'!D44,'Tablas Resto de Ecuador'!D44)","v":7318},{"$f":"IF('INGRESO DE DATOS'!$W$19=1,'Tablas Guyanas y Santa Elena'!E44,'Tablas Resto de Ecuador'!E44)","v":6645},{"$f":"IF('INGRESO DE DATOS'!$W$19=1,'Tablas Guyanas y Santa Elena'!F44,'Tablas Resto de Ecuador'!F44)","v":5644},{"$f":"IF('INGRESO DE DATOS'!$W$19=1,'Tablas Guyanas y Santa Elena'!G44,'Tablas Resto de Ecuador'!G44)","v":3547},{"$f":"IF('INGRESO DE DATOS'!$W$19=1,'Tablas Guyanas y Santa Elena'!H44,'Tablas Resto de Ecuador'!H44)","v":3095},{"$f":"IF('INGRESO DE DATOS'!$W$19=1,'Tablas Guyanas y Santa Elena'!I44,'Tablas Resto de Ecuador'!I44)","v":2536},null,8627,7318,6645,5644,3547,3095,2536]
[57,null,8901,7745,6938,5876,3689,3294,2749,null,{"$f":"IF('INGRESO DE DATOS'!$W$19=1,'Tablas Guyanas y Santa Elena'!C45,'Tablas Resto de Ecuador'!C45)","v":8901},{"$f":"IF('INGRESO DE DATOS'!$W$19=1,'Tablas Guyanas y Santa Elena'!D45,'Tablas Resto de Ecuador'!D45)","v":7745},{"$f":"IF('INGRESO DE DATOS'!$W$19=1,'Tablas Guyanas y Santa Elena'!E45,'Tablas Resto de Ecuador'!E45)","v":6938},{"$f":"IF('INGRESO DE DATOS'!$W$19=1,'Tablas Guyanas y Santa Elena'!F45,'Tablas Resto de Ecuador'!F45)","v":5876},{"$f":"IF('INGRESO DE DATOS'!$W$19=1,'Tablas Guyanas y Santa Elena'!G45,'Tablas Resto de Ecuador'!G45)","v":3689},{"$f":"IF('INGRESO DE DATOS'!$W$19=1,'Tablas Guyanas y Santa Elena'!H45,'Tablas Resto de Ecuador'!H45)","v":3294},{"$f":"IF('INGRESO DE DATOS'!$W$19=1,'Tablas Guyanas y Santa Elena'!I45,'Tablas Resto de Ecuador'!I45)","v":2749},null,8901,7745,6938,5876,3689,3294,2749]
[58,null,9210,8007,7245,6133,3896,3403,2978,null,{"$f":"IF('INGRESO DE DATOS'!$W$19=1,'Tablas Guyanas y Santa Elena'!C46,'Tablas Resto de Ecuador'!C46)","v":9210},{"$f":"IF('INGRESO DE DATOS'!$W$19=1,'Tablas Guyanas y Santa Elena'!D46,'Tablas Resto de Ecuador'!D46)","v":8007},{"$f":"IF('INGRESO DE DATOS'!$W$19=1,'Tablas Guyanas y Santa Elena'!E46,'Tablas Resto de Ecuador'!E46)","v":7245},{"$f":"IF('INGRESO DE DATOS'!$W$19=1,'Tablas Guyanas y Santa Elena'!F46,'Tablas Resto de Ecuador'!F46)","v":6133},{"$f":"IF('INGRESO DE DATOS'!$W$19=1,'Tablas Guyanas y Santa Elena'!G46,'Tablas Resto de Ecuador'!G46)","v":3896},{"$f":"IF('INGRESO DE DATOS'!$W$19=1,'Tablas Guyanas y Santa Elena'!H46,'Tablas Resto de Ecuador'!H46)","v":3403},{"$f":"IF('INGRESO DE DATOS'!$W$19=1,'Tablas Guyanas y Santa Elena'!I46,'Tablas Resto de Ecuador'!I46)","v":2978},null,9210,8007,7245,6133,3896,3403,2978]
[59,null,9519,8278,7501,6374,4168,3527,3122,null,{"$f":"IF('INGRESO DE DATOS'!$W$19=1,'Tablas Guyanas y Santa Elena'!C47,'Tablas Resto de Ecuador'!C47)","v":9519},{"$f":"IF('INGRESO DE DATOS'!$W$19=1,'Tablas Guyanas y Santa Elena'!D47,'Tablas Resto de Ecuador'!D47)","v":8278},{"$f":"IF('INGRESO DE DATOS'!$W$19=1,'Tablas Guyanas y Santa Elena'!E47,'Tablas Resto de Ecuador'!E47)","v":7501},{"$f":"IF('INGRESO DE DATOS'!$W$19=1,'Tablas Guyanas y Santa Elena'!F47,'Tablas Resto de Ecuador'!F47)","v":6374},{"$f":"IF('INGRESO DE DATOS'!$W$19=1,'Tablas Guyanas y Santa Elena'!G47,'Tablas Resto de Ecuador'!G47)","v":4168},{"$f":"IF('INGRESO DE DATOS'!$W$19=1,'Tablas Guyanas y Santa Elena'!H47,'Tablas Resto de Ecuador'!H47)","v":3527},{"$f":"IF('INGRESO DE DATOS'!$W$19=1,'Tablas Guyanas y Santa Elena'!I47,'Tablas Resto de Ecuador'!I47)","v":3122},null,9519,8278,7501,6374,4168,3527,3122]
[60,null,9825,8542,7726,6590,4492,3659,3237,null,{"$f":"IF('INGRESO DE DATOS'!$W$19=1,'Tablas Guyanas y Santa Elena'!C48,'Tablas Resto de Ecuador'!C48)","v":9825},{"$f":"IF('INGRESO DE DATOS'!$W$19=1,'Tablas Guyanas y Santa Elena'!D48,'Tablas Resto de Ecuador'!D48)","v":8542},{"$f":"IF('INGRESO DE DATOS'!$W$19=1,'Tablas Guyanas y Santa Elena'!E48,'Tablas Resto de Ecuador'!E48)","v":7726},{"$f":"IF('INGRESO DE DATOS'!$W$19=1,'Tablas Guyanas y Santa Elena'!F48,'Tablas Resto de Ecuador'!F48)","v":6590},{"$f":"IF('INGRESO DE DATOS'!$W$19=1,'Tablas Guyanas y Santa Elena'!G48,'Tablas Resto de Ecuador'!G48)","v":4492},{"$f":"IF('INGRESO DE DATOS'!$W$19=1,'Tablas Guyanas y Santa Elena'!H48,'Tablas Resto de Ecuador'!H48)","v":3659},{"$f":"IF('INGRESO DE DATOS'!$W$19=1,'Tablas Guyanas y Santa Elena'!I48,'Tablas Resto de Ecuador'!I48)","v":3237},null,9825,8542,7726,6590,4492,3659,3237]
[61,null,10205,8871,8058,6843,4866,3819,3380,null,{"$f":"IF('INGRESO DE DATOS'!$W$19=1,'Tablas Guyanas y Santa Elena'!C49,'Tablas Resto de Ecuador'!C49)","v":10205},{"$f":"IF('INGRESO DE DATOS'!$W$19=1,'Tablas Guyanas y Santa Elena'!D49,'Tablas Resto de Ecuador'!D49)","v":8871},{"$f":"IF('INGRESO DE DATOS'!$W$19=1,'Tablas Guyanas y Santa Elena'!E49,'Tablas Resto de Ecuador'!E49)","v":8058},{"$f":"IF('INGRESO DE DATOS'!$W$19=1,'Tablas Guyanas y Santa Elena'!F49,'Tablas Resto de Ecuador'!F49)","v":6843},{"$f":"IF('INGRESO DE DATOS'!$W$19=1,'Tablas Guyanas y Santa Elena'!G49,'Tablas Resto de Ecuador'!G49)","v":4866},{"$f":"IF('INGRESO DE DATOS'!$W$19=1,'Tablas Guyanas y Santa Elena'!H49,'Tablas Resto de Ecuador'!H49)","v":3819},{"$f":"IF('INGRESO DE DATOS'!$W$19=1,'Tablas Guyanas y Santa Elena'!I49,'Tablas Resto de Ecuador'!I49)","v":3380},null,10205,8871,8058,6843,4866,3819,3380]
[62,null,10849,9315,8442,7194,5289,4026,3573,null,{"$f":"IF('INGRESO DE DATOS'!$W$19=1,'Tablas Guyanas y Santa Elena'!C50,'Tablas Resto de Ecuador'!C50)","v":10849},{"$f":"IF('INGRESO DE DATOS'!$W$19=1,'Tablas Guyanas y Santa Elena'!D50,'Tablas Resto de Ecuador'!D50)","v":9315},{"$f":"IF('INGRESO DE DATOS'!$W$19=1,'Tablas Guyanas y Santa Elena'!E50,'Tablas Resto de Ecuador'!E50)","v":8442},{"$f":"IF('INGRESO DE DATOS'!$W$19=1,'Tablas Guyanas y Santa Elena'!F50,'Tablas Resto de Ecuador'!F50)","v":7194},{"$f":"IF('INGRESO DE DATOS'!$W$19=1,'Tablas Guyanas y Santa Elena'!G50,'Tablas Resto de Ecuador'!G50)","v":5289},{"$f":"IF('INGRESO DE DATOS'!$W$19=1,'Tablas Guyanas y Santa Elena'!H50,'Tablas Resto de Ecuador'!H50)","v":4026},{"$f":"IF('INGRESO DE DATOS'!$W$19=1,'Tablas Guyanas y Santa Elena'!I50,'Tablas Resto de Ecuador'!I50)","v":3573},null,10849,9315,8442,7194,5289,4026,3573]
[63,null,11603,9988,8892,7704,5562,4300,3836,null,{"$f":"IF('INGRESO DE DATOS'!$W$19=1,'Tablas Guyanas y Santa Elena'!C51,'Tablas Resto de Ecuador'!C51)","v":11603},{"$f":"IF('INGRESO DE DATOS'!$W$19=1,'Tablas Guyanas y Santa Elena'!D51,'Tablas Resto de Ecuador'!D51)","v":9988},{"$f":"IF('INGRESO DE DATOS'!$W$19=1,'Tablas Guyanas y Santa Elena'!E51,'Tablas Resto de Ecuador'!E51)","v":8892},{"$f":"IF('INGRESO DE DATOS'!$W$19=1,'Tablas Guyanas y Santa Elena'!F51,'Tablas Resto de Ecuador'!F51)","v":7704},{"$f":"IF('INGRESO DE DATOS'!$W$19=1,'Tablas Guyanas y Santa Elena'!G51,'Tablas Resto de Ecuador'!G51)","v":5562},{"$f":"IF('INGRESO DE DATOS'!$W$19=1,'Tablas Guyanas y Santa Elena'!H51,'Tablas Resto de Ecuador'!H51)","v":4300},{"$f":"IF('INGRESO DE DATOS'!$W$19=1,'Tablas Guyanas y Santa Elena'!I51,'Tablas Resto de Ecuador'!I51)","v":3836},null,11603,9988,8892,7704,5562,4300,3836]
[64,null,12409,10713,9399,8357,5882,4629,4193,null,{"$f":"IF('INGRESO DE DATOS'!$W$19=1,'Tablas Guyanas y Santa Elena'!C52,'Tablas Resto de Ecuador'!C52)","v":12409},{"$f":"IF('INGRESO DE DATOS'!$W$19=1,'Tablas Guyanas y Santa Elena'!D52,'Tablas Resto de Ecuador'!D52)","v":10713},{"$f":"IF('INGRESO DE DATOS'!$W$19=1,'Tablas Guyanas y Santa Elena'!E52,'Tablas Resto de Ecuador'!E52)","v":9399},{"$f":"IF('INGRESO DE DATOS'!$W$19=1,'Tablas Guyanas y Santa Elena'!F52,'Tablas Resto de Ecuador'!F52)","v":8357},{"$f":"IF('INGRESO DE DATOS'!$W$19=1,'Tablas Guyanas y Santa Elena'!G52,'Tablas Resto de Ecuador'!G52)","v":5882},{"$f":"IF('INGRESO DE DATOS'!$W$19=1,'Tablas Guyanas y Santa Elena'!H52,'Tablas Resto de Ecuador'!H52)","v":4629},{"$f":"IF('INGRESO DE DATOS'!$W$19=1,'Tablas Guyanas y Santa Elena'!I52,'Tablas Resto de Ecuador'!I52)","v":4193},null,12409,10713,9399,8357,5882,4629,4193]
[65,null,13279,11493,10013,9111,6298,5000,4632,null,{"$f":"IF('INGRESO DE DATOS'!$W$19=1,'Tablas Guyanas y Santa Elena'!C53,'Tablas Resto de Ecuador'!C53)","v":13279},{"$f":"IF('INGRESO DE DATOS'!$W$19=1,'Tablas Guyanas y Santa Elena'!D53,'Tablas Resto de Ecuador'!D53)","v":11493},{"$f":"IF('INGRESO DE DATOS'!$W$19=1,'Tablas Guyanas y Santa Elena'!E53,'Tablas Resto de Ecuador'!E53)","v":10013},{"$f":"IF('INGRESO DE DATOS'!$W$19=1,'Tablas Guyanas y Santa Elena'!F53,'Tablas Resto de Ecuador'!F53)","v":9111},{"$f":"IF('INGRESO DE DATOS'!$W$19=1,'Tablas Guyanas y Santa Elena'!G53,'Tablas Resto de Ecuador'!G53)","v":6298},{"$f":"IF('INGRESO DE DATOS'!$W$19=1,'Tablas Guyanas y Santa Elena'!H53,'Tablas Resto de Ecuador'!H53)","v":5000},{"$f":"IF('INGRESO DE DATOS'!$W$19=1,'Tablas Guyanas y Santa Elena'!I53,'Tablas Resto de Ecuador'!I53)","v":4632},null,13279,11493,10013,9111,6298,5000,4632]
[66,null,14212,12336,10736,9873,6782,5431,5114,null,{"$f":"IF('INGRESO DE DATOS'!$W$19=1,'Tablas Guyanas y Santa Elena'!C54,'Tablas Resto de Ecuador'!C54)","v":14212},{"$f":"IF('INGRESO DE DATOS'!$W$19=1,'Tablas Guyanas y Santa Elena'!D54,'Tablas Resto de Ecuador'!D54)","v":12336},{"$f":"IF('INGRESO DE DATOS'!$W$19=1,'Tablas Guyanas y Santa Elena'!E54,'Tablas Resto de Ecuador'!E54)","v":10736},{"$f":"IF('INGRESO DE DATOS'!$W$19=1,'Tablas Guyanas y Santa Elena'!F54,'Tablas Resto de Ecuador'!F54)","v":9873},{"$f":"IF('INGRESO DE DATOS'!$W$19=1,'Tablas Guyanas y Santa Elena'!G54,'Tablas Resto de Ecuador'!G54)","v":6782},{"$f":"IF('INGRESO DE DATOS'!$W$19=1,'Tablas Guyanas y Santa Elena'!H54,'Tablas Resto de Ecuador'!H54)","v":5431},{"$f":"IF('INGRESO DE DATOS'!$W$19=1,'Tablas Guyanas y Santa Elena'!I54,'Tablas Resto de Ecuador'!I54)","v":5114},null,14212,12336,10736,9873,6782,5431,5114]
[67,null,15216,13240,11594,10671,7328,5941,5602,null,{"$f":"IF('INGRESO DE DATOS'!$W$19=1,'Tablas Guyanas y Santa Elena'!C55,'Tablas Resto de Ecuador'!C55)","v":15216},{"$f":"IF('INGRESO DE DATOS'!$W$19=1,'Tablas Guyanas y Santa Elena'!D55,'Tablas Resto de Ecuador'!D55)","v":13240},{"$f":"IF('INGRESO DE DATOS'!$W$19=1,'Tablas Guyanas y Santa Elena'!E55,'Tablas Resto de Ecuador'!E55)","v":11594},{"$f":"IF('INGRESO DE DATOS'!$W$19=1,'Tablas Guyanas y Santa Elena'!F55,'Tablas Resto de Ecuador'!F55)","v":10671},{"$f":"IF('INGRESO DE DATOS'!$W$19=1,'Tablas Guyanas y Santa Elena'!G55,'Tablas Resto de Ecuador'!G55)","v":7328},{"$f":"IF('INGRESO DE DATOS'!$W$19=1,'Tablas Guyanas y Santa Elena'!H55,'Tablas Resto de Ecuador'!H55)","v":5941},{"$f":"IF('INGRESO DE DATOS'!$W$19=1,'Tablas Guyanas y Santa Elena'!I55,'Tablas Resto de Ecuador'!I55)","v":5602},null,15216,13240,11594,10671,7328,5941,5602]
[68,null,16292,14213,12577,11570,7943,6547,6059,null,{"$f":"IF('INGRESO DE DATOS'!$W$19=1,'Tablas Guyanas y Santa Elena'!C56,'Tablas Resto de Ecuador'!C56)","v":16292},{"$f":"IF('INGRESO DE DATOS'!$W$19=1,'Tablas Guyanas y Santa Elena'!D56,'Tablas Resto de Ecuador'!D56)","v":14213},{"$f":"IF('INGRESO DE DATOS'!$W$19=1,'Tablas Guyanas y Santa Elena'!E56,'Tablas Resto de Ecuador'!E56)","v":12577},{"$f":"IF('INGRESO DE DATOS'!$W$19=1,'Tablas Guyanas y Santa Elena'!F56,'Tablas Resto de Ecuador'!F56)","v":11570},{"$f":"IF('INGRESO DE DATOS'!$W$19=1,'Tablas Guyanas y Santa Elena'!G56,'Tablas Resto de Ecuador'!G56)","v":7943},{"$f":"IF('INGRESO DE DATOS'!$W$19=1,'Tablas Guyanas y Santa Elena'!H56,'Tablas Resto de Ecuador'!H56)","v":6547},{"$f":"IF('INGRESO DE DATOS'!$W$19=1,'Tablas Guyanas y Santa Elena'!I56,'Tablas Resto de Ecuador'!I56)","v":6059},null,16292,14213,12577,11570,7943,6547,6059]
[69,null,17449,15261,13722,12634,8677,7222,6425,null,{"$f":"IF('INGRESO DE DATOS'!$W$19=1,'Tablas Guyanas y Santa Elena'!C57,'Tablas Resto de Ecuador'!C57)","v":17449},{"$f":"IF('INGRESO DE DATOS'!$W$19=1,'Tablas Guyanas y Santa Elena'!D57,'Tablas Resto de Ecuador'!D57)","v":15261},{"$f":"IF('INGRESO DE DATOS'!$W$19=1,'Tablas Guyanas y Santa Elena'!E57,'Tablas Resto de Ecuador'!E57)","v":13722},{"$f":"IF('INGRESO DE DATOS'!$W$19=1,'Tablas Guyanas y Santa Elena'!F57,'Tablas Resto de Ecuador'!F57)","v":12634},{"$f":"IF('INGRESO DE DATOS'!$W$19=1,'Tablas Guyanas y Santa Elena'!G57,'Tablas Resto de Ecuador'!G57)","v":8677},{"$f":"IF('INGRESO DE DATOS'!$W$19=1,'Tablas Guyanas y Santa Elena'!H57,'Tablas Resto de Ecuador'!H57)","v":7222},{"$f":"IF('INGRESO DE DATOS'!$W$19=1,'Tablas Guyanas y Santa Elena'!I57,'Tablas Resto de Ecuador'!I57)","v":6425},null,17449,15261,13722,12634,8677,7222,6425]
[70,null,18986,16511,14923,14059,9596,7955,6726,null,{"$f":"IF('INGRESO DE DATOS'!$W$19=1,'Tablas Guyanas y Santa Elena'!C58,'Tablas Resto de Ecuador'!C58)","v":18986},{"$f":"IF('INGRESO DE DATOS'!$W$19=1,'Tablas Guyanas y Santa Elena'!D58,'Tablas Resto de Ecuador'!D58)","v":16511},{"$f":"IF('INGRESO DE DATOS'!$W$19=1,'Tablas Guyanas y Santa Elena'!E58,'Tablas Resto de Ecuador'!E58)","v":14923},{"$f":"IF('INGRESO DE DATOS'!$W$19=1,'Tablas Guyanas y Santa Elena'!F58,'Tablas Resto de Ecuador'!F58)","v":14059},{"$f":"IF('INGRESO DE DATOS'!$W$19=1,'Tablas Guyanas y Santa Elena'!G58,'Tablas Resto de Ecuador'!G58)","v":9596},{"$f":"IF('INGRESO DE DATOS'!$W$19=1,'Tablas Guyanas y Santa Elena'!H58,'Tablas Resto de Ecuador'!H58)","v":7955},{"$f":"IF('INGRESO DE DATOS'!$W$19=1,'Tablas Guyanas y Santa Elena'!I58,'Tablas Resto de Ecuador'!I58)","v":6726},null,18986,16511,14923,14059,9596,7955,6726]
[71,null,20908,18183,16577,15482,10570,8785,7050,null,{"$f":"IF('INGRESO DE DATOS'!$W$19=1,'Tablas Guyanas y Santa Elena'!C59,'Tablas Resto de Ecuador'!C59)","v":20908},{"$f":"IF('INGRESO DE DATOS'!$W$19=1,'Tablas Guyanas y Santa Elena'!D59,'Tablas Resto de Ecuador'!D59)","v":18183},{"$f":"IF('INGRESO DE DATOS'!$W$19=1,'Tablas Guyanas y Santa Elena'!E59,'Tablas Resto de Ecuador'!E59)","v":16577},{"$f":"IF('INGRESO DE DATOS'!$W$19=1,'Tablas Guyanas y Santa Elena'!F59,'Tablas Resto de Ecuador'!F59)","v":15482},{"$f":"IF('INGRESO DE DATOS'!$W$19=1,'Tablas Guyanas y Santa Elena'!G59,'Tablas Resto de Ecuador'!G59)","v":10570},{"$f":"IF('INGRESO DE DATOS'!$W$19=1,'Tablas Guyanas y Santa Elena'!H59,'Tablas Resto de Ecuador'!H59)","v":8785},{"$f":"IF('INGRESO DE DATOS'!$W$19=1,'Tablas Guyanas y Santa Elena'!I59,'Tablas Resto de Ecuador'!I59)","v":7050},null,20908,18183,16577,15482,10570,8785,7050]
[72,null,23129,20111,18341,17134,11698,9754,7484,null,{"$f":"IF('INGRESO DE DATOS'!$W$19=1,'Tablas Guyanas y Santa Elena'!C60,'Tablas Resto de Ecuador'!C60)","v":23129},{"$f":"IF('INGRESO DE DATOS'!$W$19=1,'Tablas Guyanas y Santa Elena'!D60,'Tablas Resto de Ecuador'!D60)","v":20111},{"$f":"IF('INGRESO DE DATOS'!$W$19=1,'Tablas Guyanas y Santa Elena'!E60,'Tablas Resto de Ecuador'!E60)","v":18341},{"$f":"IF('INGRESO DE DATOS'!$W$19=1,'Tablas Guyanas y Santa Elena'!F60,'Tablas Resto de Ecuador'!F60)","v":17134},{"$f":"IF('INGRESO DE DATOS'!$W$19=1,'Tablas Guyanas y Santa Elena'!G60,'Tablas Resto de Ecuador'!G60)","v":11698},{"$f":"IF('INGRESO DE DATOS'!$W$19=1,'Tablas Guyanas y Santa Elena'!H60,'Tablas Resto de Ecuador'!H60)","v":9754},{"$f":"IF('INGRESO DE DATOS'!$W$19=1,'Tablas Guyanas y Santa Elena'!I60,'Tablas Resto de Ecuador'!I60)","v":7484},null,23129,20111,18341,17134,11698,9754,7484]
[73,null,25690,22337,20365,19022,12983,10903,8115,null,{"$f":"IF('INGRESO DE DATOS'!$W$19=1,'Tablas Guyanas y Santa Elena'!C61,'Tablas Resto de Ecuador'!C61)","v":25690},{"$f":"IF('INGRESO DE DATOS'!$W$19=1,'Tablas Guyanas y Santa Elena'!D61,'Tablas Resto de Ecuador'!D61)","v":22337},{"$f":"IF('INGRESO DE DATOS'!$W$19=1,'Tablas Guyanas y Santa Elena'!E61,'Tablas Resto de Ecuador'!E61)","v":20365},{"$f":"IF('INGRESO DE DATOS'!$W$19=1,'Tablas Guyanas y Santa Elena'!F61,'Tablas Resto de Ecuador'!F61)","v":19022},{"$f":"IF('INGRESO DE DATOS'!$W$19=1,'Tablas Guyanas y Santa Elena'!G61,'Tablas Resto de Ecuador'!G61)","v":12983},{"$f":"IF('INGRESO DE DATOS'!$W$19=1,'Tablas Guyanas y Santa Elena'!H61,'Tablas Resto de Ecuador'!H61)","v":10903},{"$f":"IF('INGRESO DE DATOS'!$W$19=1,'Tablas Guyanas y Santa Elena'!I61,'Tablas Resto de Ecuador'!I61)","v":8115},null,25690,22337,20365,19022,12983,10903,8115]
[74,null,28641,24902,22706,21210,14479,12250,8999,null,{"$f":"IF('INGRESO DE DATOS'!$W$19=1,'Tablas Guyanas y Santa Elena'!C62,'Tablas Resto de Ecuador'!C62)","v":28641},{"$f":"IF('INGRESO DE DATOS'!$W$19=1,'Tablas Guyanas y Santa Elena'!D62,'Tablas Resto de Ecuador'!D62)","v":24902},{"$f":"IF('INGRESO DE DATOS'!$W$19=1,'Tablas Guyanas y Santa Elena'!E62,'Tablas Resto de Ecuador'!E62)","v":22706},{"$f":"IF('INGRESO DE DATOS'!$W$19=1,'Tablas Guyanas y Santa Elena'!F62,'Tablas Resto de Ecuador'!F62)","v":21210},{"$f":"IF('INGRESO DE DATOS'!$W$19=1,'Tablas Guyanas y Santa Elena'!G62,'Tablas Resto de Ecuador'!G62)","v":14479},{"$f":"IF('INGRESO DE DATOS'!$W$19=1,'Tablas Guyanas y Santa Elena'!H62,'Tablas Resto de Ecuador'!H62)","v":12250},{"$f":"IF('INGRESO DE DATOS'!$W$19=1,'Tablas Guyanas y Santa Elena'!I62,'Tablas Resto de Ecuador'!I62)","v":8999},null,28641,24902,22706,21210,14479,12250,8999]
[75,null,32022,27847,25287,23865,16246,13201,10078,null,{"$f":"IF('INGRESO DE DATOS'!$W$19=1,'Tablas Guyanas y Santa Elena'!C63,'Tablas Resto de Ecuador'!C63)","v":32022},{"$f":"IF('INGRESO DE DATOS'!$W$19=1,'Tablas Guyanas y Santa Elena'!D63,'Tablas Resto de Ecuador'!D63)","v":27847},{"$f":"IF('INGRESO DE DATOS'!$W$19=1,'Tablas Guyanas y Santa Elena'!E63,'Tablas Resto de Ecuador'!E63)","v":25287},{"$f":"IF('INGRESO DE DATOS'!$W$19=1,'Tablas Guyanas y Santa Elena'!F63,'Tablas Resto de Ecuador'!F63)","v":23865},{"$f":"IF('INGRESO DE DATOS'!$W$19=1,'Tablas Guyanas y Santa Elena'!G63,'Tablas Resto de Ecuador'!G63)","v":16246},{"$f":"IF('INGRESO DE DATOS'!$W$19=1,'Tablas Guyanas y Santa Elena'!H63,'Tablas Resto de Ecuador'!H63)","v":13201},{"$f":"IF('INGRESO DE DATOS'!$W$19=1,'Tablas Guyanas y Santa Elena'!I63,'Tablas Resto de Ecuador'!I63)","v":10078},null,32022,27847,25287,23865,16246,13201,10078]
[76,null,34933,31226,28450,26758,18215,14214,11269,null,{"$f":"IF('INGRESO DE DATOS'!$W$19=1,'Tablas Guyanas y Santa Elena'!C64,'Tablas Resto de Ecuador'!C64)","v":34933},{"$f":"IF('INGRESO DE DATOS'!$W$19=1,'Tablas Guyanas y Santa Elena'!D64,'Tablas Resto de Ecuador'!D64)","v":31226},{"$f":"IF('INGRESO DE DATOS'!$W$19=1,'Tablas Guyanas y Santa Elena'!E64,'Tablas Resto de Ecuador'!E64)","v":28450},{"$f":"IF('INGRESO DE DATOS'!$W$19=1,'Tablas Guyanas y Santa Elena'!F64,'Tablas Resto de Ecuador'!F64)","v":26758},{"$f":"IF('INGRESO DE DATOS'!$W$19=1,'Tablas Guyanas y Santa Elena'!G64,'Tablas Resto de Ecuador'!G64)","v":18215},{"$f":"IF('INGRESO DE DATOS'!$W$19=1,'Tablas Guyanas y Santa Elena'!H64,'Tablas Resto de Ecuador'!H64)","v":14214},{"$f":"IF('INGRESO DE DATOS'!$W$19=1,'Tablas Guyanas y Santa Elena'!I64,'Tablas Resto de Ecuador'!I64)","v":11269},null,34933,31226,28450,26758,18215,14214,11269]
[77,null,37773,35071,31975,30053,20463,15894,12487,null,{"$f":"IF('INGRESO DE DATOS'!$W$19=1,'Tablas Guyanas y Santa Elena'!C65,'Tablas Resto de Ecuador'!C65)","v":37773},{"$f":"IF('INGRESO DE DATOS'!$W$19=1,'Tablas Guyanas y Santa Elena'!D65,'Tablas Resto de Ecuador'!D65)","v":35071},{"$f":"IF('INGRESO DE DATOS'!$W$19=1,'Tablas Guyanas y Santa Elena'!E65,'Tablas Resto de Ecuador'!E65)","v":31975},{"$f":"IF('INGRESO DE DATOS'!$W$19=1,'Tablas Guyanas y Santa Elena'!F65,'Tablas Resto de Ecuador'!F65)","v":30053},{"$f":"IF('INGRESO DE DATOS'!$W$19=1,'Tablas Guyanas y Santa Elena'!G65,'Tablas Resto de Ecuador'!G65)","v":20463},{"$f":"IF('INGRESO DE DATOS'!$W$19=1,'Tablas Guyanas y Santa Elena'!H65,'Tablas Resto de Ecuador'!H65)","v":15894},{"$f":"IF('INGRESO DE DATOS'!$W$19=1,'Tablas Guyanas y Santa Elena'!I65,'Tablas Resto de Ecuador'!I65)","v":12487},null,37773,35071,31975,30053,20463,15894,12487]
[78,null,40529,38378,34820,33056,22991,17066,13649,null,{"$f":"IF('INGRESO DE DATOS'!$W$19=1,'Tablas Guyanas y Santa Elena'!C66,'Tablas Resto de Ecuador'!C66)","v":40529},{"$f":"IF('INGRESO DE DATOS'!$W$19=1,'Tablas Guyanas y Santa Elena'!D66,'Tablas Resto de Ecuador'!D66)","v":38378},{"$f":"IF('INGRESO DE DATOS'!$W$19=1,'Tablas Guyanas y Santa Elena'!E66,'Tablas Resto de Ecuador'!E66)","v":34820},{"$f":"IF('INGRESO DE DATOS'!$W$19=1,'Tablas Guyanas y Santa Elena'!F66,'Tablas Resto de Ecuador'!F66)","v":33056},{"$f":"IF('INGRESO DE DATOS'!$W$19=1,'Tablas Guyanas y Santa Elena'!G66,'Tablas Resto de Ecuador'!G66)","v":22991},{"$f":"IF('INGRESO DE DATOS'!$W$19=1,'Tablas Guyanas y Santa Elena'!H66,'Tablas Resto de Ecuador'!H66)","v":17066},{"$f":"IF('INGRESO DE DATOS'!$W$19=1,'Tablas Guyanas y Santa Elena'!I66,'Tablas Resto de Ecuador'!I66)","v":13649},null,40529,38378,34820,33056,22991,17066,13649]
[79,null,43199,41077,37404,35503,25833,18287,14616,null,{"$f":"IF('INGRESO DE DATOS'!$W$19=1,'Tablas Guyanas y Santa Elena'!C67,'Tablas Resto de Ecuador'!C67)","v":43199},{"$f":"IF('INGRESO DE DATOS'!$W$19=1,'Tablas Guyanas y Santa Elena'!D67,'Tablas Resto de Ecuador'!D67)","v":41077},{"$f":"IF('INGRESO DE DATOS'!$W$19=1,'Tablas Guyanas y Santa Elena'!E67,'Tablas Resto de Ecuador'!E67)","v":37404},{"$f":"IF('INGRESO DE DATOS'!$W$19=1,'Tablas Guyanas y Santa Elena'!F67,'Tablas Resto de Ecuador'!F67)","v":35503},{"$f":"IF('INGRESO DE DATOS'!$W$19=1,'Tablas Guyanas y Santa Elena'!G67,'Tablas Resto de Ecuador'!G67)","v":25833},{"$f":"IF('INGRESO DE DATOS'!$W$19=1,'Tablas Guyanas y Santa Elena'!H67,'Tablas Resto de Ecuador'!H67)","v":18287},{"$f":"IF('INGRESO DE DATOS'!$W$19=1,'Tablas Guyanas y Santa Elena'!I67,'Tablas Resto de Ecuador'!I67)","v":14616},null,43199,41077,37404,35503,25833,18287,14616]
[80,null,45870,43777,39988,37949,29230,20293,15546,null,{"$f":"IF('INGRESO DE DATOS'!$W$19=1,'Tablas Guyanas y Santa Elena'!C68,'Tablas Resto de Ecuador'!C68)","v":45870},{"$f":"IF('INGRESO DE DATOS'!$W$19=1,'Tablas Guyanas y Santa Elena'!D68,'Tablas Resto de Ecuador'!D68)","v":43777},{"$f":"IF('INGRESO DE DATOS'!$W$19=1,'Tablas Guyanas y Santa Elena'!E68,'Tablas Resto de Ecuador'!E68)","v":39988},{"$f":"IF('INGRESO DE DATOS'!$W$19=1,'Tablas Guyanas y Santa Elena'!F68,'Tablas Resto de Ecuador'!F68)","v":37949},{"$f":"IF('INGRESO DE DATOS'!$W$19=1,'Tablas Guyanas y Santa Elena'!G68,'Tablas Resto de Ecuador'!G68)","v":29230},{"$f":"IF('INGRESO DE DATOS'!$W$19=1,'Tablas Guyanas y Santa Elena'!H68,'Tablas Resto de Ecuador'!H68)","v":20293},{"$f":"IF('INGRESO DE DATOS'!$W$19=1,'Tablas Guyanas y Santa Elena'!I68,'Tablas Resto de Ecuador'!I68)","v":15546},null,45870,43777,39988,37949,29230,20293,15546]
[81,null,45870,43777,39988,37949,29230,20293,15546,null,{"$f":"IF('INGRESO DE DATOS'!$W$19=1,'Tablas Guyanas y Santa Elena'!C69,'Tablas Resto de Ecuador'!C69)","v":45870},{"$f":"IF('INGRESO DE DATOS'!$W$19=1,'Tablas Guyanas y Santa Elena'!D69,'Tablas Resto de Ecuador'!D69)","v":43777},{"$f":"IF('INGRESO DE DATOS'!$W$19=1,'Tablas Guyanas y Santa Elena'!E69,'Tablas Resto de Ecuador'!E69)","v":39988},{"$f":"IF('INGRESO DE DATOS'!$W$19=1,'Tablas Guyanas y Santa Elena'!F69,'Tablas Resto de Ecuador'!F69)","v":37949},{"$f":"IF('INGRESO DE DATOS'!$W$19=1,'Tablas Guyanas y Santa Elena'!G69,'Tablas Resto de Ecuador'!G69)","v":29230},{"$f":"IF('INGRESO DE DATOS'!$W$19=1,'Tablas Guyanas y Santa Elena'!H69,'Tablas Resto de Ecuador'!H69)","v":20293},{"$f":"IF('INGRESO DE DATOS'!$W$19=1,'Tablas Guyanas y Santa Elena'!I69,'Tablas Resto de Ecuador'!I69)","v":15546},null,45870,43777,39988,37949,29230,20293,15546]
[82,null,45870,43777,39988,37949,29230,20293,15546,null,{"$f":"IF('INGRESO DE DATOS'!$W$19=1,'Tablas Guyanas y Santa Elena'!C70,'Tablas Resto de Ecuador'!C70)","v":45870},{"$f":"IF('INGRESO DE DATOS'!$W$19=1,'Tablas Guyanas y Santa Elena'!D70,'Tablas Resto de Ecuador'!D70)","v":43777},{"$f":"IF('INGRESO DE DATOS'!$W$19=1,'Tablas Guyanas y Santa Elena'!E70,'Tablas Resto de Ecuador'!E70)","v":39988},{"$f":"IF('INGRESO DE DATOS'!$W$19=1,'Tablas Guyanas y Santa Elena'!F70,'Tablas Resto de Ecuador'!F70)","v":37949},{"$f":"IF('INGRESO DE DATOS'!$W$19=1,'Tablas Guyanas y Santa Elena'!G70,'Tablas Resto de Ecuador'!G70)","v":29230},{"$f":"IF('INGRESO DE DATOS'!$W$19=1,'Tablas Guyanas y Santa Elena'!H70,'Tablas Resto de Ecuador'!H70)","v":20293},{"$f":"IF('INGRESO DE DATOS'!$W$19=1,'Tablas Guyanas y Santa Elena'!I70,'Tablas Resto de Ecuador'!I70)","v":15546},null,45870,43777,39988,37949,29230,20293,15546]
[83,null,{"$f":"S74*$AD$2","v":45870},{"$f":"T74*$AD$2","v":43777},{"$f":"U74*$AD$2","v":39988},{"$f":"V74*$AD$2","v":37949},{"$f":"W74*$AD$2","v":29230},{"$f":"X74*$AD$2","v":20293},{"$f":"Y74*$AD$2","v":15546},null,{"$f":"IF('INGRESO DE DATOS'!$W$19=1,'Tablas Guyanas y Santa Elena'!C71,'Tablas Resto de Ecuador'!C71)","v":45870},{"$f":"IF('INGRESO DE DATOS'!$W$19=1,'Tablas Guyanas y Santa Elena'!D71,'Tablas Resto de Ecuador'!D71)","v":43777},{"$f":"IF('INGRESO DE DATOS'!$W$19=1,'Tablas Guyanas y Santa Elena'!E71,'Tablas Resto de Ecuador'!E71)","v":39988},{"$f":"IF('INGRESO DE DATOS'!$W$19=1,'Tablas Guyanas y Santa Elena'!F71,'Tablas Resto de Ecuador'!F71)","v":37949},{"$f":"IF('INGRESO DE DATOS'!$W$19=1,'Tablas Guyanas y Santa Elena'!G71,'Tablas Resto de Ecuador'!G71)","v":29230},{"$f":"IF('INGRESO DE DATOS'!$W$19=1,'Tablas Guyanas y Santa Elena'!H71,'Tablas Resto de Ecuador'!H71)","v":20293},{"$f":"IF('INGRESO DE DATOS'!$W$19=1,'Tablas Guyanas y Santa Elena'!I71,'Tablas Resto de Ecuador'!I71)","v":15546},null,{"$f":"K74*$T$4","v":45870},{"$f":"L74*$T$4","v":43777},{"$f":"M74*$T$4","v":39988},{"$f":"N74*$T$4","v":37949},{"$f":"O74*$T$4","v":29230},{"$f":"P74*$T$4","v":20293},{"$f":"Q74*$T$4","v":15546}]
[84,"o más",45870,43777,39988,37949,29230,20293,15546,null,{"$f":"IF('INGRESO DE DATOS'!$W$19=1,'Tablas Guyanas y Santa Elena'!C72,'Tablas Resto de Ecuador'!C72)","v":45870},{"$f":"IF('INGRESO DE DATOS'!$W$19=1,'Tablas Guyanas y Santa Elena'!D72,'Tablas Resto de Ecuador'!D72)","v":43777},{"$f":"IF('INGRESO DE DATOS'!$W$19=1,'Tablas Guyanas y Santa Elena'!E72,'Tablas Resto de Ecuador'!E72)","v":39988},{"$f":"IF('INGRESO DE DATOS'!$W$19=1,'Tablas Guyanas y Santa Elena'!F72,'Tablas Resto de Ecuador'!F72)","v":37949},{"$f":"IF('INGRESO DE DATOS'!$W$19=1,'Tablas Guyanas y Santa Elena'!G72,'Tablas Resto de Ecuador'!G72)","v":29230},{"$f":"IF('INGRESO DE DATOS'!$W$19=1,'Tablas Guyanas y Santa Elena'!H72,'Tablas Resto de Ecuador'!H72)","v":20293},{"$f":"IF('INGRESO DE DATOS'!$W$19=1,'Tablas Guyanas y Santa Elena'!I72,'Tablas Resto de Ecuador'!I72)","v":15546},null,45870,43777,39988,37949,29230,20293,15546]
[1,"Hijo",1022,1059,653,583,415,368,216,null,{"$f":"IF('INGRESO DE DATOS'!$W$19=1,'Tablas Guyanas y Santa Elena'!C73,'Tablas Resto de Ecuador'!C73)","v":1022},{"$f":"IF('INGRESO DE DATOS'!$W$19=1,'Tablas Guyanas y Santa Elena'!D73,'Tablas Resto de Ecuador'!D73)","v":1059},{"$f":"IF('INGRESO DE DATOS'!$W$19=1,'Tablas Guyanas y Santa Elena'!E73,'Tablas Resto de Ecuador'!E73)","v":653},{"$f":"IF('INGRESO DE DATOS'!$W$19=1,'Tablas Guyanas y Santa Elena'!F73,'Tablas Resto de Ecuador'!F73)","v":583},{"$f":"IF('INGRESO DE DATOS'!$W$19=1,'Tablas Guyanas y Santa Elena'!G73,'Tablas Resto de Ecuador'!G73)","v":415},{"$f":"IF('INGRESO DE DATOS'!$W$19=1,'Tablas Guyanas y Santa Elena'!H73,'Tablas Resto de Ecuador'!H73)","v":368},{"$f":"IF('INGRESO DE DATOS'!$W$19=1,'Tablas Guyanas y Santa Elena'!I73,'Tablas Resto de Ecuador'!I73)","v":216},null,1022,1059,653,583,415,368,216]
[2,"Hijos",1956,1966,1245,1103,746,435,287,null,{"$f":"IF('INGRESO DE DATOS'!$W$19=1,'Tablas Guyanas y Santa Elena'!C74,'Tablas Resto de Ecuador'!C74)","v":1956},{"$f":"IF('INGRESO DE DATOS'!$W$19=1,'Tablas Guyanas y Santa Elena'!D74,'Tablas Resto de Ecuador'!D74)","v":1966},{"$f":"IF('INGRESO DE DATOS'!$W$19=1,'Tablas Guyanas y Santa Elena'!E74,'Tablas Resto de Ecuador'!E74)","v":1245},{"$f":"IF('INGRESO DE DATOS'!$W$19=1,'Tablas Guyanas y Santa Elena'!F74,'Tablas Resto de Ecuador'!F74)","v":1103},{"$f":"IF('INGRESO DE DATOS'!$W$19=1,'Tablas Guyanas y Santa Elena'!G74,'Tablas Resto de Ecuador'!G74)","v":746},{"$f":"IF('INGRESO DE DATOS'!$W$19=1,'Tablas Guyanas y Santa Elena'!H74,'Tablas Resto de Ecuador'!H74)","v":435},{"$f":"IF('INGRESO DE DATOS'!$W$19=1,'Tablas Guyanas y Santa Elena'!I74,'Tablas Resto de Ecuador'!I74)","v":287},null,1956,1966,1245,1103,746,435,287]
[3,"Hijos o más",2838,2800,1802,1587,1033,603,431,null,{"$f":"IF('INGRESO DE DATOS'!$W$19=1,'Tablas Guyanas y Santa Elena'!C75,'Tablas Resto de Ecuador'!C75)","v":2838},{"$f":"IF('INGRESO DE DATOS'!$W$19=1,'Tablas Guyanas y Santa Elena'!D75,'Tablas Resto de Ecuador'!D75)","v":2800},{"$f":"IF('INGRESO DE DATOS'!$W$19=1,'Tablas Guyanas y Santa Elena'!E75,'Tablas Resto de Ecuador'!E75)","v":1802},{"$f":"IF('INGRESO DE DATOS'!$W$19=1,'Tablas Guyanas y Santa Elena'!F75,'Tablas Resto de Ecuador'!F75)","v":1587},{"$f":"IF('INGRESO DE DATOS'!$W$19=1,'Tablas Guyanas y Santa Elena'!G75,'Tablas Resto de Ecuador'!G75)","v":1033},{"$f":"IF('INGRESO DE DATOS'!$W$19=1,'Tablas Guyanas y Santa Elena'!H75,'Tablas Resto de Ecuador'!H75)","v":603},{"$f":"IF('INGRESO DE DATOS'!$W$19=1,'Tablas Guyanas y Santa Elena'!I75,'Tablas Resto de Ecuador'!I75)","v":431},null,2838,2800,1802,1587,1033,603,431]
[]
["BUPA ESSENTIAL 500"]
["TARIFAS ANUALES"]
[]
["EDAD",null,250,500,1000,2000,5000,10000,20000,null,"TARIFAS BASE",null,null,null,null,null,null,null,"TARIFAS BASE CON DESCUENTO"]
[18,null,{"$f":"S84*$AD$2","v":2829},{"$f":"T84*$AD$2","v":2419},{"$f":"U84*$AD$2","v":1771},{"$f":"V84*$AD$2","v":1221},{"$f":"W84*$AD$2","v":666},{"$f":"X84*$AD$2","v":384},{"$f":"Y84*$AD$2","v":221},null,{"$f":"IF('INGRESO DE DATOS'!$W$19=1,'Tablas Guyanas y Santa Elena'!C81,'Tablas Resto de Ecuador'!C81)","v":2829},{"$f":"IF('INGRESO DE DATOS'!$W$19=1,'Tablas Guyanas y Santa Elena'!D81,'Tablas Resto de Ecuador'!D81)","v":2419},{"$f":"IF('INGRESO DE DATOS'!$W$19=1,'Tablas Guyanas y Santa Elena'!E81,'Tablas Resto de Ecuador'!E81)","v":1771},{"$f":"IF('INGRESO DE DATOS'!$W$19=1,'Tablas Guyanas y Santa Elena'!F81,'Tablas Resto de Ecuador'!F81)","v":1221},{"$f":"IF('INGRESO DE DATOS'!$W$19=1,'Tablas Guyanas y Santa Elena'!G81,'Tablas Resto de Ecuador'!G81)","v":666},{"$f":"IF('INGRESO DE DATOS'!$W$19=1,'Tablas Guyanas y Santa Elena'!H81,'Tablas Resto de Ecuador'!H81)","v":384},{"$f":"IF('INGRESO DE DATOS'!$W$19=1,'Tablas Guyanas y Santa Elena'!I81,'Tablas Resto de Ecuador'!I81)","v":221},null,{"$f":"K84*$U$4","v":2829},{"$f":"L84*$U$4","v":2419},1771,1221,666,384,221]
[19,null,{"$f":"S85*$AD$2","v":2875},{"$f":"T85*$AD$2","v":2419},{"$f":"U85*$AD$2","v":1771},{"$f":"V85*$AD$2","v":1223},{"$f":"W85*$AD$2","v":673},{"$f":"X85*$AD$2","v":390},{"$f":"Y85*$AD$2","v":226},null,{"$f":"IF('INGRESO DE DATOS'!$W$19=1,'Tablas Guyanas y Santa Elena'!C82,'Tablas Resto de Ecuador'!C82)","v":2875},{"$f":"IF('INGRESO DE DATOS'!$W$19=1,'Tablas Guyanas y Santa Elena'!D82,'Tablas Resto de Ecuador'!D82)","v":2419},{"$f":"IF('INGRESO DE DATOS'!$W$19=1,'Tablas Guyanas y Santa Elena'!E82,'Tablas Resto de Ecuador'!E82)","v":1771},{"$f":"IF('INGRESO DE DATOS'!$W$19=1,'Tablas Guyanas y Santa Elena'!F82,'Tablas Resto de Ecuador'!F82)","v":1223},{"$f":"IF('INGRESO DE DATOS'!$W$19=1,'Tablas Guyanas y Santa Elena'!G82,'Tablas Resto de Ecuador'!G82)","v":673},{"$f":"IF('INGRESO DE DATOS'!$W$19=1,'Tablas Guyanas y Santa Elena'!H82,'Tablas Resto de Ecuador'!H82)","v":390},{"$f":"IF('INGRESO DE DATOS'!$W$19=1,'Tablas Guyanas y Santa Elena'!I82,'Tablas Resto de Ecuador'!I82)","v":226},null,{"$f":"K85*$U$4","v":2875},{"$f":"L85*$U$4","v":2419},{"$f":"M85*$U$4","v":1771},{"$f":"N85*$U$4","v":1223},{"$f":"O85*$U$4","v":673},{"$f":"P85*$U$4","v":390},{"$f":"Q85*$U$4","v":226}]
[20,null,2925,2419,1771,1227,680,395,231,null,{"$f":"IF('INGRESO DE DATOS'!$W$19=1,'Tablas Guyanas y Santa Elena'!C83,'Tablas Resto de Ecuador'!C83)","v":2925},{"$f":"IF('INGRESO DE DATOS'!$W$19=1,'Tablas Guyanas y Santa Elena'!D83,'Tablas Resto de Ecuador'!D83)","v":2419},{"$f":"IF('INGRESO DE DATOS'!$W$19=1,'Tablas Guyanas y Santa Elena'!E83,'Tablas Resto de Ecuador'!E83)","v":1771},{"$f":"IF('INGRESO DE DATOS'!$W$19=1,'Tablas Guyanas y Santa Elena'!F83,'Tablas Resto de Ecuador'!F83)","v":1227},{"$f":"IF('INGRESO DE DATOS'!$W$19=1,'Tablas Guyanas y Santa Elena'!G83,'Tablas Resto de Ecuador'!G83)","v":680},{"$f":"IF('INGRESO DE DATOS'!$W$19=1,'Tablas Guyanas y Santa Elena'!H83,'Tablas Resto de Ecuador'!H83)","v":395},{"$f":"IF('INGRESO DE DATOS'!$W$19=1,'Tablas Guyanas y Santa Elena'!I83,'Tablas Resto de Ecuador'!I83)","v":231},null,2925,2419,1771,1227,680,395,231]
[21,null,2982,2419,1774,1234,689,404,238,null,{"$f":"IF('INGRESO DE DATOS'!$W$19=1,'Tablas Guyanas y Santa Elena'!C84,'Tablas Resto de Ecuador'!C84)","v":2982},{"$f":"IF('INGRESO DE DATOS'!$W$19=1,'Tablas Guyanas y Santa Elena'!D84,'Tablas Resto de Ecuador'!D84)","v":2419},{"$f":"IF('INGRESO DE DATOS'!$W$19=1,'Tablas Guyanas y Santa Elena'!E84,'Tablas Resto de Ecuador'!E84)","v":1774},{"$f":"IF('INGRESO DE DATOS'!$W$19=1,'Tablas Guyanas y Santa Elena'!F84,'Tablas Resto de Ecuador'!F84)","v":1234},{"$f":"IF('INGRESO DE DATOS'!$W$19=1,'Tablas Guyanas y Santa Elena'!G84,'Tablas Resto de Ecuador'!G84)","v":689},{"$f":"IF('INGRESO DE DATOS'!$W$19=1,'Tablas Guyanas y Santa Elena'!H84,'Tablas Resto de Ecuador'!H84)","v":404},{"$f":"IF('INGRESO DE DATOS'!$W$19=1,'Tablas Guyanas y Santa Elena'!I84,'Tablas Resto de Ecuador'!I84)","v":238},null,2982,2419,1774,1234,689,404,238]
[22,null,3029,2419,1780,1243,698,411,243,null,{"$f":"IF('INGRESO DE DATOS'!$W$19=1,'Tablas Guyanas y Santa Elena'!C85,'Tablas Resto de Ecuador'!C85)","v":3029},{"$f":"IF('INGRESO DE DATOS'!$W$19=1,'Tablas Guyanas y Santa Elena'!D85,'Tablas Resto de Ecuador'!D85)","v":2419},{"$f":"IF('INGRESO DE DATOS'!$W$19=1,'Tablas Guyanas y Santa Elena'!E85,'Tablas Resto de Ecuador'!E85)","v":1780},{"$f":"IF('INGRESO DE DATOS'!$W$19=1,'Tablas Guyanas y Santa Elena'!F85,'Tablas Resto de Ecuador'!F85)","v":1243},{"$f":"IF('INGRESO DE DATOS'!$W$19=1,'Tablas Guyanas y Santa Elena'!G85,'Tablas Resto de Ecuador'!G85)","v":698},{"$f":"IF('INGRESO DE DATOS'!$W$19=1,'Tablas Guyanas y Santa Elena'!H85,'Tablas Resto de Ecuador'!H85)","v":411},{"$f":"IF('INGRESO DE DATOS'!$W$19=1,'Tablas Guyanas y Santa Elena'!I85,'Tablas Resto de Ecuador'!I85)","v":243},null,3029,2419,1780,1243,698,411,243]
[23,null,3079,2426,1792,1256,710,421,250,null,{"$f":"IF('INGRESO DE DATOS'!$W$19=1,'Tablas Guyanas y Santa Elena'!C86,'Tablas Resto de Ecuador'!C86)","v":3079},{"$f":"IF('INGRESO DE DATOS'!$W$19=1,'Tablas Guyanas y Santa Elena'!D86,'Tablas Resto de Ecuador'!D86)","v":2426},{"$f":"IF('INGRESO DE DATOS'!$W$19=1,'Tablas Guyanas y Santa Elena'!E86,'Tablas Resto de Ecuador'!E86)","v":1792},{"$f":"IF('INGRESO DE DATOS'!$W$19=1,'Tablas Guyanas y Santa Elena'!F86,'Tablas Resto de Ecuador'!F86)","v":1256},{"$f":"IF('INGRESO DE DATOS'!$W$19=1,'Tablas Guyanas y Santa Elena'!G86,'Tablas Resto de Ecuador'!G86)","v":710},{"$f":"IF('INGRESO DE DATOS'!$W$19=1,'Tablas Guyanas y Santa Elena'!H86,'Tablas Resto de Ecuador'!H86)","v":421},{"$f":"IF('INGRESO DE DATOS'!$W$19=1,'Tablas Guyanas y Santa Elena'!I86,'Tablas Resto de Ecuador'!I86)","v":250},null,3079,2426,1792,1256,710,421,250]
[24,null,3088,2438,1806,1274,723,432,258,null,{"$f":"IF('INGRESO DE DATOS'!$W$19=1,'Tablas Guyanas y Santa Elena'!C87,'Tablas Resto de Ecuador'!C87)","v":3088},{"$f":"IF('INGRESO DE DATOS'!$W$19=1,'Tablas Guyanas y Santa Elena'!D87,'Tablas Resto de Ecuador'!D87)","v":2438},{"$f":"IF('INGRESO DE DATOS'!$W$19=1,'Tablas Guyanas y Santa Elena'!E87,'Tablas Resto de Ecuador'!E87)","v":1806},{"$f":"IF('INGRESO DE DATOS'!$W$19=1,'Tablas Guyanas y Santa Elena'!F87,'Tablas Resto de Ecuador'!F87)","v":1274},{"$f":"IF('INGRESO DE DATOS'!$W$19=1,'Tablas Guyanas y Santa Elena'!G87,'Tablas Resto de Ecuador'!G87)","v":723},{"$f":"IF('INGRESO DE DATOS'!$W$19=1,'Tablas Guyanas y Santa Elena'!H87,'Tablas Resto de Ecuador'!H87)","v":432},{"$f":"IF('INGRESO DE DATOS'!$W$19=1,'Tablas Guyanas y Santa Elena'!I87,'Tablas Resto de Ecuador'!I87)","v":258},null,3088,2438,1806,1274,723,432,258]
[25,null,3101,2454,1824,1292,738,444,267,null,{"$f":"IF('INGRESO DE DATOS'!$W$19=1,'Tablas Guyanas y Santa Elena'!C88,'Tablas Resto de Ecuador'!C88)","v":3101},{"$f":"IF('INGRESO DE DATOS'!$W$19=1,'Tablas Guyanas y Santa Elena'!D88,'Tablas Resto de Ecuador'!D88)","v":2454},{"$f":"IF('INGRESO DE DATOS'!$W$19=1,'Tablas Guyanas y Santa Elena'!E88,'Tablas Resto de Ecuador'!E88)","v":1824},{"$f":"IF('INGRESO DE DATOS'!$W$19=1,'Tablas Guyanas y Santa Elena'!F88,'Tablas Resto de Ecuador'!F88)","v":1292},{"$f":"IF('INGRESO DE DATOS'!$W$19=1,'Tablas Guyanas y Santa Elena'!G88,'Tablas Resto de Ecuador'!G88)","v":738},{"$f":"IF('INGRESO DE DATOS'!$W$19=1,'Tablas Guyanas y Santa Elena'!H88,'Tablas Resto de Ecuador'!H88)","v":444},{"$f":"IF('INGRESO DE DATOS'!$W$19=1,'Tablas Guyanas y Santa Elena'!I88,'Tablas Resto de Ecuador'!I88)","v":267},null,3101,2454,1824,1292,738,444,267]
[26,null,3125,2479,1851,1315,757,456,277,null,{"$f":"IF('INGRESO DE DATOS'!$W$19=1,'Tablas Guyanas y Santa Elena'!C89,'Tablas Resto de Ecuador'!C89)","v":3125},{"$f":"IF('INGRESO DE DATOS'!$W$19=1,'Tablas Guyanas y Santa Elena'!D89,'Tablas Resto de Ecuador'!D89)","v":2479},{"$f":"IF('INGRESO DE DATOS'!$W$19=1,'Tablas Guyanas y Santa Elena'!E89,'Tablas Resto de Ecuador'!E89)","v":1851},{"$f":"IF('INGRESO DE DATOS'!$W$19=1,'Tablas Guyanas y Santa Elena'!F89,'Tablas Resto de Ecuador'!F89)","v":1315},{"$f":"IF('INGRESO DE DATOS'!$W$19=1,'Tablas Guyanas y Santa Elena'!G89,'Tablas Resto de Ecuador'!G89)","v":757},{"$f":"IF('INGRESO DE DATOS'!$W$19=1,'Tablas Guyanas y Santa Elena'!H89,'Tablas Resto de Ecuador'!H89)","v":456},{"$f":"IF('INGRESO DE DATOS'!$W$19=1,'Tablas Guyanas y Santa Elena'!I89,'Tablas Resto de Ecuador'!I89)","v":277},null,3125,2479,1851,1315,757,456,277]
[27,null,3156,2510,1881,1340,775,470,287,null,{"$f":"IF('INGRESO DE DATOS'!$W$19=1,'Tablas Guyanas y Santa Elena'!C90,'Tablas Resto de Ecuador'!C90)","v":3156},{"$f":"IF('INGRESO DE DATOS'!$W$19=1,'Tablas Guyanas y Santa Elena'!D90,'Tablas Resto de Ecuador'!D90)","v":2510},{"$f":"IF('INGRESO DE DATOS'!$W$19=1,'Tablas Guyanas y Santa Elena'!E90,'Tablas Resto de Ecuador'!E90)","v":1881},{"$f":"IF('INGRESO DE DATOS'!$W$19=1,'Tablas Guyanas y Santa Elena'!F90,'Tablas Resto de Ecuador'!F90)","v":1340},{"$f":"IF('INGRESO DE DATOS'!$W$19=1,'Tablas Guyanas y Santa Elena'!G90,'Tablas Resto de Ecuador'!G90)","v":775},{"$f":"IF('INGRESO DE DATOS'!$W$19=1,'Tablas Guyanas y Santa Elena'!H90,'Tablas Resto de Ecuador'!H90)","v":470},{"$f":"IF('INGRESO DE DATOS'!$W$19=1,'Tablas Guyanas y Santa Elena'!I90,'Tablas Resto de Ecuador'!I90)","v":287},null,3156,2510,1881,1340,775,470,287]
[28,null,3195,2547,1914,1370,798,486,297,null,{"$f":"IF('INGRESO DE DATOS'!$W$19=1,'Tablas Guyanas y Santa Elena'!C91,'Tablas Resto de Ecuador'!C91)","v":3195},{"$f":"IF('INGRESO DE DATOS'!$W$19=1,'Tablas Guyanas y Santa Elena'!D91,'Tablas Resto de Ecuador'!D91)","v":2547},{"$f":"IF('INGRESO DE DATOS'!$W$19=1,'Tablas Guyanas y Santa Elena'!E91,'Tablas Resto de Ecuador'!E91)","v":1914},{"$f":"IF('INGRESO DE DATOS'!$W$19=1,'Tablas Guyanas y Santa Elena'!F91,'Tablas Resto de Ecuador'!F91)","v":1370},{"$f":"IF('INGRESO DE DATOS'!$W$19=1,'Tablas Guyanas y Santa Elena'!G91,'Tablas Resto de Ecuador'!G91)","v":798},{"$f":"IF('INGRESO DE DATOS'!$W$19=1,'Tablas Guyanas y Santa Elena'!H91,'Tablas Resto de Ecuador'!H91)","v":486},{"$f":"IF('INGRESO DE DATOS'!$W$19=1,'Tablas Guyanas y Santa Elena'!I91,'Tablas Resto de Ecuador'!I91)","v":297},null,3195,2547,1914,1370,798,486,297]
[29,null,3242,2589,1952,1404,822,503,312,null,{"$f":"IF('INGRESO DE DATOS'!$W$19=1,'Tablas Guyanas y Santa Elena'!C92,'Tablas Resto de Ecuador'!C92)","v":3242},{"$f":"IF('INGRESO DE DATOS'!$W$19=1,'Tablas Guyanas y Santa Elena'!D92,'Tablas Resto de Ecuador'!D92)","v":2589},{"$f":"IF('INGRESO DE DATOS'!$W$19=1,'Tablas Guyanas y Santa Elena'!E92,'Tablas Resto de Ecuador'!E92)","v":1952},{"$f":"IF('INGRESO DE DATOS'!$W$19=1,'Tablas Guyanas y Santa Elena'!F92,'Tablas Resto de Ecuador'!F92)","v":1404},{"$f":"IF('INGRESO DE DATOS'!$W$19=1,'Tablas Guyanas y Santa Elena'!G92,'Tablas Resto de Ecuador'!G92)","v":822},{"$f":"IF('INGRESO DE DATOS'!$W$19=1,'Tablas Guyanas y Santa Elena'!H92,'Tablas Resto de Ecuador'!H92)","v":503},{"$f":"IF('INGRESO DE DATOS'!$W$19=1,'Tablas Guyanas y Santa Elena'!I92,'Tablas Resto de Ecuador'!I92)","v":312},null,3242,2589,1952,1404,822,503,312]
[30,null,3295,2641,1998,1442,850,523,325,null,{"$f":"IF('INGRESO DE DATOS'!$W$19=1,'Tablas Guyanas y Santa Elena'!C93,'Tablas Resto de Ecuador'!C93)","v":3295},{"$f":"IF('INGRESO DE DATOS'!$W$19=1,'Tablas Guyanas y Santa Elena'!D93,'Tablas Resto de Ecuador'!D93)","v":2641},{"$f":"IF('INGRESO DE DATOS'!$W$19=1,'Tablas Guyanas y Santa Elena'!E93,'Tablas Resto de Ecuador'!E93)","v":1998},{"$f":"IF('INGRESO DE DATOS'!$W$19=1,'Tablas Guyanas y Santa Elena'!F93,'Tablas Resto de Ecuador'!F93)","v":1442},{"$f":"IF('INGRESO DE DATOS'!$W$19=1,'Tablas Guyanas y Santa Elena'!G93,'Tablas Resto de Ecuador'!G93)","v":850},{"$f":"IF('INGRESO DE DATOS'!$W$19=1,'Tablas Guyanas y Santa Elena'!H93,'Tablas Resto de Ecuador'!H93)","v":523},{"$f":"IF('INGRESO DE DATOS'!$W$19=1,'Tablas Guyanas y Santa Elena'!I93,'Tablas Resto de Ecuador'!I93)","v":325},null,3295,2641,1998,1442,850,523,325]
[31,null,3360,2700,2050,1483,878,543,341,null,{"$f":"IF('INGRESO DE DATOS'!$W$19=1,'Tablas Guyanas y Santa Elena'!C94,'Tablas Resto de Ecuador'!C94)","v":3360},{"$f":"IF('INGRESO DE DATOS'!$W$19=1,'Tablas Guyanas y Santa Elena'!D94,'Tablas Resto de Ecuador'!D94)","v":2700},{"$f":"IF('INGRESO DE DATOS'!$W$19=1,'Tablas Guyanas y Santa Elena'!E94,'Tablas Resto de Ecuador'!E94)","v":2050},{"$f":"IF('INGRESO DE DATOS'!$W$19=1,'Tablas Guyanas y Santa Elena'!F94,'Tablas Resto de Ecuador'!F94)","v":1483},{"$f":"IF('INGRESO DE DATOS'!$W$19=1,'Tablas Guyanas y Santa Elena'!G94,'Tablas Resto de Ecuador'!G94)","v":878},{"$f":"IF('INGRESO DE DATOS'!$W$19=1,'Tablas Guyanas y Santa Elena'!H94,'Tablas Resto de Ecuador'!H94)","v":543},{"$f":"IF('INGRESO DE DATOS'!$W$19=1,'Tablas Guyanas y Santa Elena'!I94,'Tablas Resto de Ecuador'!I94)","v":341},null,3360,2700,2050,1483,878,543,341]
[32,null,3435,2768,2104,1527,912,566,356,null,{"$f":"IF('INGRESO DE DATOS'!$W$19=1,'Tablas Guyanas y Santa Elena'!C95,'Tablas Resto de Ecuador'!C95)","v":3435},{"$f":"IF('INGRESO DE DATOS'!$W$19=1,'Tablas Guyanas y Santa Elena'!D95,'Tablas Resto de Ecuador'!D95)","v":2768},{"$f":"IF('INGRESO DE DATOS'!$W$19=1,'Tablas Guyanas y Santa Elena'!E95,'Tablas Resto de Ecuador'!E95)","v":2104},{"$f":"IF('INGRESO DE DATOS'!$W$19=1,'Tablas Guyanas y Santa Elena'!F95,'Tablas Resto de Ecuador'!F95)","v":1527},{"$f":"IF('INGRESO DE DATOS'!$W$19=1,'Tablas Guyanas y Santa Elena'!G95,'Tablas Resto de Ecuador'!G95)","v":912},{"$f":"IF('INGRESO DE DATOS'!$W$19=1,'Tablas Guyanas y Santa Elena'!H95,'Tablas Resto de Ecuador'!H95)","v":566},{"$f":"IF('INGRESO DE DATOS'!$W$19=1,'Tablas Guyanas y Santa Elena'!I95,'Tablas Resto de Ecuador'!I95)","v":356},null,3435,2768,2104,1527,912,566,356]
[33,null,3519,2841,2168,1580,945,591,373,null,{"$f":"IF('INGRESO DE DATOS'!$W$19=1,'Tablas Guyanas y Santa Elena'!C96,'Tablas Resto de Ecuador'!C96)","v":3519},{"$f":"IF('INGRESO DE DATOS'!$W$19=1,'Tablas Guyanas y Santa Elena'!D96,'Tablas Resto de Ecuador'!D96)","v":2841},{"$f":"IF('INGRESO DE DATOS'!$W$19=1,'Tablas Guyanas y Santa Elena'!E96,'Tablas Resto de Ecuador'!E96)","v":2168},{"$f":"IF('INGRESO DE DATOS'!$W$19=1,'Tablas Guyanas y Santa Elena'!F96,'Tablas Resto de Ecuador'!F96)","v":1580},{"$f":"IF('INGRESO DE DATOS'!$W$19=1,'Tablas Guyanas y Santa Elena'!G96,'Tablas Resto de Ecuador'!G96)","v":945},{"$f":"IF('INGRESO DE DATOS'!$W$19=1,'Tablas Guyanas y Santa Elena'!H96,'Tablas Resto de Ecuador'!H96)","v":591},{"$f":"IF('INGRESO DE DATOS'!$W$19=1,'Tablas Guyanas y Santa Elena'!I96,'Tablas Resto de Ecuador'!I96)","v":373},null,3519,2841,2168,1580,945,591,373]
[34,null,3612,2924,2238,1638,984,617,393,null,{"$f":"IF('INGRESO DE DATOS'!$W$19=1,'Tablas Guyanas y Santa Elena'!C97,'Tablas Resto de Ecuador'!C97)","v":3612},{"$f":"IF('INGRESO DE DATOS'!$W$19=1,'Tablas Guyanas y Santa Elena'!D97,'Tablas Resto de Ecuador'!D97)","v":2924},{"$f":"IF('INGRESO DE DATOS'!$W$19=1,'Tablas Guyanas y Santa Elena'!E97,'Tablas Resto de Ecuador'!E97)","v":2238},{"$f":"IF('INGRESO DE DATOS'!$W$19=1,'Tablas Guyanas y Santa Elena'!F97,'Tablas Resto de Ecuador'!F97)","v":1638},{"$f":"IF('INGRESO DE DATOS'!$W$19=1,'Tablas Guyanas y Santa Elena'!G97,'Tablas Resto de Ecuador'!G97)","v":984},{"$f":"IF('INGRESO DE DATOS'!$W$19=1,'Tablas Guyanas y Santa Elena'!H97,'Tablas Resto de Ecuador'!H97)","v":617},{"$f":"IF('INGRESO DE DATOS'!$W$19=1,'Tablas Guyanas y Santa Elena'!I97,'Tablas Resto de Ecuador'!I97)","v":393},null,3612,2924,2238,1638,984,617,393]
[35,null,3716,3015,2315,1700,1027,647,414,null,{"$f":"IF('INGRESO DE DATOS'!$W$19=1,'Tablas Guyanas y Santa Elena'!C98,'Tablas Resto de Ecuador'!C98)","v":3716},{"$f":"IF('INGRESO DE DATOS'!$W$19=1,'Tablas Guyanas y Santa Elena'!D98,'Tablas Resto de Ecuador'!D98)","v":3015},{"$f":"IF('INGRESO DE DATOS'!$W$19=1,'Tablas Guyanas y Santa Elena'!E98,'Tablas Resto de Ecuador'!E98)","v":2315},{"$f":"IF('INGRESO DE DATOS'!$W$19=1,'Tablas Guyanas y Santa Elena'!F98,'Tablas Resto de Ecuador'!F98)","v":1700},{"$f":"IF('INGRESO DE DATOS'!$W$19=1,'Tablas Guyanas y Santa Elena'!G98,'Tablas Resto de Ecuador'!G98)","v":1027},{"$f":"IF('INGRESO DE DATOS'!$W$19=1,'Tablas Guyanas y Santa Elena'!H98,'Tablas Resto de Ecuador'!H98)","v":647},{"$f":"IF('INGRESO DE DATOS'!$W$19=1,'Tablas Guyanas y Santa Elena'!I98,'Tablas Resto de Ecuador'!I98)","v":414},null,3716,3015,2315,1700,1027,647,414]
[36,null,3831,3116,2400,1765,1073,680,437,null,{"$f":"IF('INGRESO DE DATOS'!$W$19=1,'Tablas Guyanas y Santa Elena'!C99,'Tablas Resto de Ecuador'!C99)","v":3831},{"$f":"IF('INGRESO DE DATOS'!$W$19=1,'Tablas Guyanas y Santa Elena'!D99,'Tablas Resto de Ecuador'!D99)","v":3116},{"$f":"IF('INGRESO DE DATOS'!$W$19=1,'Tablas Guyanas y Santa Elena'!E99,'Tablas Resto de Ecuador'!E99)","v":2400},{"$f":"IF('INGRESO DE DATOS'!$W$19=1,'Tablas Guyanas y Santa Elena'!F99,'Tablas Resto de Ecuador'!F99)","v":1765},{"$f":"IF('INGRESO DE DATOS'!$W$19=1,'Tablas Guyanas y Santa Elena'!G99,'Tablas Resto de Ecuador'!G99)","v":1073},{"$f":"IF('INGRESO DE DATOS'!$W$19=1,'Tablas Guyanas y Santa Elena'!H99,'Tablas Resto de Ecuador'!H99)","v":680},{"$f":"IF('INGRESO DE DATOS'!$W$19=1,'Tablas Guyanas y Santa Elena'!I99,'Tablas Resto de Ecuador'!I99)","v":437},null,3831,3116,2400,1765,1073,680,437]
[37,null,3959,3228,2490,1839,1123,714,462,null,{"$f":"IF('INGRESO DE DATOS'!$W$19=1,'Tablas Guyanas y Santa Elena'!C100,'Tablas Resto de Ecuador'!C100)","v":3959},{"$f":"IF('INGRESO DE DATOS'!$W$19=1,'Tablas Guyanas y Santa Elena'!D100,'Tablas Resto de Ecuador'!D100)","v":3228},{"$f":"IF('INGRESO DE DATOS'!$W$19=1,'Tablas Guyanas y Santa Elena'!E100,'Tablas Resto de Ecuador'!E100)","v":2490},{"$f":"IF('INGRESO DE DATOS'!$W$19=1,'Tablas Guyanas y Santa Elena'!F100,'Tablas Resto de Ecuador'!F100)","v":1839},{"$f":"IF('INGRESO DE DATOS'!$W$19=1,'Tablas Guyanas y Santa Elena'!G100,'Tablas Resto de Ecuador'!G100)","v":1123},{"$f":"IF('INGRESO DE DATOS'!$W$19=1,'Tablas Guyanas y Santa Elena'!H100,'Tablas Resto de Ecuador'!H100)","v":714},{"$f":"IF('INGRESO DE DATOS'!$W$19=1,'Tablas Guyanas y Santa Elena'!I100,'Tablas Resto de Ecuador'!I100)","v":462},null,3959,3228,2490,1839,1123,714,462]
[38,null,4094,3346,2589,1920,1177,751,490,null,{"$f":"IF('INGRESO DE DATOS'!$W$19=1,'Tablas Guyanas y Santa Elena'!C101,'Tablas Resto de Ecuador'!C101)","v":4094},{"$f":"IF('INGRESO DE DATOS'!$W$19=1,'Tablas Guyanas y Santa Elena'!D101,'Tablas Resto de Ecuador'!D101)","v":3346},{"$f":"IF('INGRESO DE DATOS'!$W$19=1,'Tablas Guyanas y Santa Elena'!E101,'Tablas Resto de Ecuador'!E101)","v":2589},{"$f":"IF('INGRESO DE DATOS'!$W$19=1,'Tablas Guyanas y Santa Elena'!F101,'Tablas Resto de Ecuador'!F101)","v":1920},{"$f":"IF('INGRESO DE DATOS'!$W$19=1,'Tablas Guyanas y Santa Elena'!G101,'Tablas Resto de Ecuador'!G101)","v":1177},{"$f":"IF('INGRESO DE DATOS'!$W$19=1,'Tablas Guyanas y Santa Elena'!H101,'Tablas Resto de Ecuador'!H101)","v":751},{"$f":"IF('INGRESO DE DATOS'!$W$19=1,'Tablas Guyanas y Santa Elena'!I101,'Tablas Resto de Ecuador'!I101)","v":490},null,4094,3346,2589,1920,1177,751,490]
[39,null,4245,3477,2700,2006,1235,792,517,null,{"$f":"IF('INGRESO DE DATOS'!$W$19=1,'Tablas Guyanas y Santa Elena'!C102,'Tablas Resto de Ecuador'!C102)","v":4245},{"$f":"IF('INGRESO DE DATOS'!$W$19=1,'Tablas Guyanas y Santa Elena'!D102,'Tablas Resto de Ecuador'!D102)","v":3477},{"$f":"IF('INGRESO DE DATOS'!$W$19=1,'Tablas Guyanas y Santa Elena'!E102,'Tablas Resto de Ecuador'!E102)","v":2700},{"$f":"IF('INGRESO DE DATOS'!$W$19=1,'Tablas Guyanas y Santa Elena'!F102,'Tablas Resto de Ecuador'!F102)","v":2006},{"$f":"IF('INGRESO DE DATOS'!$W$19=1,'Tablas Guyanas y Santa Elena'!G102,'Tablas Resto de Ecuador'!G102)","v":1235},{"$f":"IF('INGRESO DE DATOS'!$W$19=1,'Tablas Guyanas y Santa Elena'!H102,'Tablas Resto de Ecuador'!H102)","v":792},{"$f":"IF('INGRESO DE DATOS'!$W$19=1,'Tablas Guyanas y Santa Elena'!I102,'Tablas Resto de Ecuador'!I102)","v":517},null,4245,3477,2700,2006,1235,792,517]
[40,null,4365,3619,2767,2101,1301,837,551,null,{"$f":"IF('INGRESO DE DATOS'!$W$19=1,'Tablas Guyanas y Santa Elena'!C103,'Tablas Resto de Ecuador'!C103)","v":4365},{"$f":"IF('INGRESO DE DATOS'!$W$19=1,'Tablas Guyanas y Santa Elena'!D103,'Tablas Resto de Ecuador'!D103)","v":3619},{"$f":"IF('INGRESO DE DATOS'!$W$19=1,'Tablas Guyanas y Santa Elena'!E103,'Tablas Resto de Ecuador'!E103)","v":2767},{"$f":"IF('INGRESO DE DATOS'!$W$19=1,'Tablas Guyanas y Santa Elena'!F103,'Tablas Resto de Ecuador'!F103)","v":2101},{"$f":"IF('INGRESO DE DATOS'!$W$19=1,'Tablas Guyanas y Santa Elena'!G103,'Tablas Resto de Ecuador'!G103)","v":1301},{"$f":"IF('INGRESO DE DATOS'!$W$19=1,'Tablas Guyanas y Santa Elena'!H103,'Tablas Resto de Ecuador'!H103)","v":837},{"$f":"IF('INGRESO DE DATOS'!$W$19=1,'Tablas Guyanas y Santa Elena'!I103,'Tablas Resto de Ecuador'!I103)","v":551},null,4365,3619,2767,2101,1301,837,551]
[41,null,4464,3773,2797,2200,1368,885,587,null,{"$f":"IF('INGRESO DE DATOS'!$W$19=1,'Tablas Guyanas y Santa Elena'!C104,'Tablas Resto de Ecuador'!C104)","v":4464},{"$f":"IF('INGRESO DE DATOS'!$W$19=1,'Tablas Guyanas y Santa Elena'!D104,'Tablas Resto de Ecuador'!D104)","v":3773},{"$f":"IF('INGRESO DE DATOS'!$W$19=1,'Tablas Guyanas y Santa Elena'!E104,'Tablas Resto de Ecuador'!E104)","v":2797},{"$f":"IF('INGRESO DE DATOS'!$W$19=1,'Tablas Guyanas y Santa Elena'!F104,'Tablas Resto de Ecuador'!F104)","v":2200},{"$f":"IF('INGRESO DE DATOS'!$W$19=1,'Tablas Guyanas y Santa Elena'!G104,'Tablas Resto de Ecuador'!G104)","v":1368},{"$f":"IF('INGRESO DE DATOS'!$W$19=1,'Tablas Guyanas y Santa Elena'!H104,'Tablas Resto de Ecuador'!H104)","v":885},{"$f":"IF('INGRESO DE DATOS'!$W$19=1,'Tablas Guyanas y Santa Elena'!I104,'Tablas Resto de Ecuador'!I104)","v":587},null,4464,3773,2797,2200,1368,885,587]
[42,null,4568,3941,2835,2314,1444,937,624,null,{"$f":"IF('INGRESO DE DATOS'!$W$19=1,'Tablas Guyanas y Santa Elena'!C105,'Tablas Resto de Ecuador'!C105)","v":4568},{"$f":"IF('INGRESO DE DATOS'!$W$19=1,'Tablas Guyanas y Santa Elena'!D105,'Tablas Resto de Ecuador'!D105)","v":3941},{"$f":"IF('INGRESO DE DATOS'!$W$19=1,'Tablas Guyanas y Santa Elena'!E105,'Tablas Resto de Ecuador'!E105)","v":2835},{"$f":"IF('INGRESO DE DATOS'!$W$19=1,'Tablas Guyanas y Santa Elena'!F105,'Tablas Resto de Ecuador'!F105)","v":2314},{"$f":"IF('INGRESO DE DATOS'!$W$19=1,'Tablas Guyanas y Santa Elena'!G105,'Tablas Resto de Ecuador'!G105)","v":1444},{"$f":"IF('INGRESO DE DATOS'!$W$19=1,'Tablas Guyanas y Santa Elena'!H105,'Tablas Resto de Ecuador'!H105)","v":937},{"$f":"IF('INGRESO DE DATOS'!$W$19=1,'Tablas Guyanas y Santa Elena'!I105,'Tablas Resto de Ecuador'!I105)","v":624},null,4568,3941,2835,2314,1444,937,624]
[43,null,4742,4122,2895,2433,1525,995,666,null,{"$f":"IF('INGRESO DE DATOS'!$W$19=1,'Tablas Guyanas y Santa Elena'!C106,'Tablas Resto de Ecuador'!C106)","v":4742},{"$f":"IF('INGRESO DE DATOS'!$W$19=1,'Tablas Guyanas y Santa Elena'!D106,'Tablas Resto de Ecuador'!D106)","v":4122},{"$f":"IF('INGRESO DE DATOS'!$W$19=1,'Tablas Guyanas y Santa Elena'!E106,'Tablas Resto de Ecuador'!E106)","v":2895},{"$f":"IF('INGRESO DE DATOS'!$W$19=1,'Tablas Guyanas y Santa Elena'!F106,'Tablas Resto de Ecuador'!F106)","v":2433},{"$f":"IF('INGRESO DE DATOS'!$W$19=1,'Tablas Guyanas y Santa Elena'!G106,'Tablas Resto de Ecuador'!G106)","v":1525},{"$f":"IF('INGRESO DE DATOS'!$W$19=1,'Tablas Guyanas y Santa Elena'!H106,'Tablas Resto de Ecuador'!H106)","v":995},{"$f":"IF('INGRESO DE DATOS'!$W$19=1,'Tablas Guyanas y Santa Elena'!I106,'Tablas Resto de Ecuador'!I106)","v":666},null,4742,4122,2895,2433,1525,995,666]
[44,null,4907,4284,2978,2562,1614,1057,711,null,{"$f":"IF('INGRESO DE DATOS'!$W$19=1,'Tablas Guyanas y Santa Elena'!C107,'Tablas Resto de Ecuador'!C107)","v":4907},{"$f":"IF('INGRESO DE DATOS'!$W$19=1,'Tablas Guyanas y Santa Elena'!D107,'Tablas Resto de Ecuador'!D107)","v":4284},{"$f":"IF('INGRESO DE DATOS'!$W$19=1,'Tablas Guyanas y Santa Elena'!E107,'Tablas Resto de Ecuador'!E107)","v":2978},{"$f":"IF('INGRESO DE DATOS'!$W$19=1,'Tablas Guyanas y Santa Elena'!F107,'Tablas Resto de Ecuador'!F107)","v":2562},{"$f":"IF('INGRESO DE DATOS'!$W$19=1,'Tablas Guyanas y Santa Elena'!G107,'Tablas Resto de Ecuador'!G107)","v":1614},{"$f":"IF('INGRESO DE DATOS'!$W$19=1,'Tablas Guyanas y Santa Elena'!H107,'Tablas Resto de Ecuador'!H107)","v":1057},{"$f":"IF('INGRESO DE DATOS'!$W$19=1,'Tablas Guyanas y Santa Elena'!I107,'Tablas Resto de Ecuador'!I107)","v":711},null,4907,4284,2978,2562,1614,1057,711]
[45,null,4857,4440,3074,2703,1708,1123,759,null,{"$f":"IF('INGRESO DE DATOS'!$W$19=1,'Tablas Guyanas y Santa Elena'!C108,'Tablas Resto de Ecuador'!C108)","v":4857},{"$f":"IF('INGRESO DE DATOS'!$W$19=1,'Tablas Guyanas y Santa Elena'!D108,'Tablas Resto de Ecuador'!D108)","v":4440},{"$f":"IF('INGRESO DE DATOS'!$W$19=1,'Tablas Guyanas y Santa Elena'!E108,'Tablas Resto de Ecuador'!E108)","v":3074},{"$f":"IF('INGRESO DE DATOS'!$W$19=1,'Tablas Guyanas y Santa Elena'!F108,'Tablas Resto de Ecuador'!F108)","v":2703},{"$f":"IF('INGRESO DE DATOS'!$W$19=1,'Tablas Guyanas y Santa Elena'!G108,'Tablas Resto de Ecuador'!G108)","v":1708},{"$f":"IF('INGRESO DE DATOS'!$W$19=1,'Tablas Guyanas y Santa Elena'!H108,'Tablas Resto de Ecuador'!H108)","v":1123},{"$f":"IF('INGRESO DE DATOS'!$W$19=1,'Tablas Guyanas y Santa Elena'!I108,'Tablas Resto de Ecuador'!I108)","v":759},null,4857,4440,3074,2703,1708,1123,759]
[46,null,4798,4598,3183,2854,1741,1195,812,null,{"$f":"IF('INGRESO DE DATOS'!$W$19=1,'Tablas Guyanas y Santa Elena'!C109,'Tablas Resto de Ecuador'!C109)","v":4798},{"$f":"IF('INGRESO DE DATOS'!$W$19=1,'Tablas Guyanas y Santa Elena'!D109,'Tablas Resto de Ecuador'!D109)","v":4598},{"$f":"IF('INGRESO DE DATOS'!$W$19=1,'Tablas Guyanas y Santa Elena'!E109,'Tablas Resto de Ecuador'!E109)","v":3183},{"$f":"IF('INGRESO DE DATOS'!$W$19=1,'Tablas Guyanas y Santa Elena'!F109,'Tablas Resto de Ecuador'!F109)","v":2854},{"$f":"IF('INGRESO DE DATOS'!$W$19=1,'Tablas Guyanas y Santa Elena'!G109,'Tablas Resto de Ecuador'!G109)","v":1741},{"$f":"IF('INGRESO DE DATOS'!$W$19=1,'Tablas Guyanas y Santa Elena'!H109,'Tablas Resto de Ecuador'!H109)","v":1195},{"$f":"IF('INGRESO DE DATOS'!$W$19=1,'Tablas Guyanas y Santa Elena'!I109,'Tablas Resto de Ecuador'!I109)","v":812},null,4798,4598,3183,2854,1741,1195,812]
[47,null,4782,4756,3304,3015,1761,1273,870,null,{"$f":"IF('INGRESO DE DATOS'!$W$19=1,'Tablas Guyanas y Santa Elena'!C110,'Tablas Resto de Ecuador'!C110)","v":4782},{"$f":"IF('INGRESO DE DATOS'!$W$19=1,'Tablas Guyanas y Santa Elena'!D110,'Tablas Resto de Ecuador'!D110)","v":4756},{"$f":"IF('INGRESO DE DATOS'!$W$19=1,'Tablas Guyanas y Santa Elena'!E110,'Tablas Resto de Ecuador'!E110)","v":3304},{"$f":"IF('INGRESO DE DATOS'!$W$19=1,'Tablas Guyanas y Santa Elena'!F110,'Tablas Resto de Ecuador'!F110)","v":3015},{"$f":"IF('INGRESO DE DATOS'!$W$19=1,'Tablas Guyanas y Santa Elena'!G110,'Tablas Resto de Ecuador'!G110)","v":1761},{"$f":"IF('INGRESO DE DATOS'!$W$19=1,'Tablas Guyanas y Santa Elena'!H110,'Tablas Resto de Ecuador'!H110)","v":1273},{"$f":"IF('INGRESO DE DATOS'!$W$19=1,'Tablas Guyanas y Santa Elena'!I110,'Tablas Resto de Ecuador'!I110)","v":870},null,4782,4756,3304,3015,1761,1273,870]
[48,null,4862,4900,3437,3038,1802,1358,933,null,{"$f":"IF('INGRESO DE DATOS'!$W$19=1,'Tablas Guyanas y Santa Elena'!C111,'Tablas Resto de Ecuador'!C111)","v":4862},{"$f":"IF('INGRESO DE DATOS'!$W$19=1,'Tablas Guyanas y Santa Elena'!D111,'Tablas Resto de Ecuador'!D111)","v":4900},{"$f":"IF('INGRESO DE DATOS'!$W$19=1,'Tablas Guyanas y Santa Elena'!E111,'Tablas Resto de Ecuador'!E111)","v":3437},{"$f":"IF('INGRESO DE DATOS'!$W$19=1,'Tablas Guyanas y Santa Elena'!F111,'Tablas Resto de Ecuador'!F111)","v":3038},{"$f":"IF('INGRESO DE DATOS'!$W$19=1,'Tablas Guyanas y Santa Elena'!G111,'Tablas Resto de Ecuador'!G111)","v":1802},{"$f":"IF('INGRESO DE DATOS'!$W$19=1,'Tablas Guyanas y Santa Elena'!H111,'Tablas Resto de Ecuador'!H111)","v":1358},{"$f":"IF('INGRESO DE DATOS'!$W$19=1,'Tablas Guyanas y Santa Elena'!I111,'Tablas Resto de Ecuador'!I111)","v":933},null,4862,4900,3437,3038,1802,1358,933]
[49,null,5063,5016,3577,3124,1868,1453,1001,null,{"$f":"IF('INGRESO DE DATOS'!$W$19=1,'Tablas Guyanas y Santa Elena'!C112,'Tablas Resto de Ecuador'!C112)","v":5063},{"$f":"IF('INGRESO DE DATOS'!$W$19=1,'Tablas Guyanas y Santa Elena'!D112,'Tablas Resto de Ecuador'!D112)","v":5016},{"$f":"IF('INGRESO DE DATOS'!$W$19=1,'Tablas Guyanas y Santa Elena'!E112,'Tablas Resto de Ecuador'!E112)","v":3577},{"$f":"IF('INGRESO DE DATOS'!$W$19=1,'Tablas Guyanas y Santa Elena'!F112,'Tablas Resto de Ecuador'!F112)","v":3124},{"$f":"IF('INGRESO DE DATOS'!$W$19=1,'Tablas Guyanas y Santa Elena'!G112,'Tablas Resto de Ecuador'!G112)","v":1868},{"$f":"IF('INGRESO DE DATOS'!$W$19=1,'Tablas Guyanas y Santa Elena'!H112,'Tablas Resto de Ecuador'!H112)","v":1453},{"$f":"IF('INGRESO DE DATOS'!$W$19=1,'Tablas Guyanas y Santa Elena'!I112,'Tablas Resto de Ecuador'!I112)","v":1001},null,5063,5016,3577,3124,1868,1453,1001]
[50,null,5348,5113,3723,3296,1950,1558,1080,null,{"$f":"IF('INGRESO DE DATOS'!$W$19=1,'Tablas Guyanas y Santa Elena'!C113,'Tablas Resto de Ecuador'!C113)","v":5348},{"$f":"IF('INGRESO DE DATOS'!$W$19=1,'Tablas Guyanas y Santa Elena'!D113,'Tablas Resto de Ecuador'!D113)","v":5113},{"$f":"IF('INGRESO DE DATOS'!$W$19=1,'Tablas Guyanas y Santa Elena'!E113,'Tablas Resto de Ecuador'!E113)","v":3723},{"$f":"IF('INGRESO DE DATOS'!$W$19=1,'Tablas Guyanas y Santa Elena'!F113,'Tablas Resto de Ecuador'!F113)","v":3296},{"$f":"IF('INGRESO DE DATOS'!$W$19=1,'Tablas Guyanas y Santa Elena'!G113,'Tablas Resto de Ecuador'!G113)","v":1950},{"$f":"IF('INGRESO DE DATOS'!$W$19=1,'Tablas Guyanas y Santa Elena'!H113,'Tablas Resto de Ecuador'!H113)","v":1558},{"$f":"IF('INGRESO DE DATOS'!$W$19=1,'Tablas Guyanas y Santa Elena'!I113,'Tablas Resto de Ecuador'!I113)","v":1080},null,5348,5113,3723,3296,1950,1558,1080]
[51,null,5683,5215,3884,3518,2045,1690,1177,null,{"$f":"IF('INGRESO DE DATOS'!$W$19=1,'Tablas Guyanas y Santa Elena'!C114,'Tablas Resto de Ecuador'!C114)","v":5683},{"$f":"IF('INGRESO DE DATOS'!$W$19=1,'Tablas Guyanas y Santa Elena'!D114,'Tablas Resto de Ecuador'!D114)","v":5215},{"$f":"IF('INGRESO DE DATOS'!$W$19=1,'Tablas Guyanas y Santa Elena'!E114,'Tablas Resto de Ecuador'!E114)","v":3884},{"$f":"IF('INGRESO DE DATOS'!$W$19=1,'Tablas Guyanas y Santa Elena'!F114,'Tablas Resto de Ecuador'!F114)","v":3518},{"$f":"IF('INGRESO DE DATOS'!$W$19=1,'Tablas Guyanas y Santa Elena'!G114,'Tablas Resto de Ecuador'!G114)","v":2045},{"$f":"IF('INGRESO DE DATOS'!$W$19=1,'Tablas Guyanas y Santa Elena'!H114,'Tablas Resto de Ecuador'!H114)","v":1690},{"$f":"IF('INGRESO DE DATOS'!$W$19=1,'Tablas Guyanas y Santa Elena'!I114,'Tablas Resto de Ecuador'!I114)","v":1177},null,5683,5215,3884,3518,2045,1690,1177]
[52,null,6030,5343,4067,3754,2151,1831,1281,null,{"$f":"IF('INGRESO DE DATOS'!$W$19=1,'Tablas Guyanas y Santa Elena'!C115,'Tablas Resto de Ecuador'!C115)","v":6030},{"$f":"IF('INGRESO DE DATOS'!$W$19=1,'Tablas Guyanas y Santa Elena'!D115,'Tablas Resto de Ecuador'!D115)","v":5343},{"$f":"IF('INGRESO DE DATOS'!$W$19=1,'Tablas Guyanas y Santa Elena'!E115,'Tablas Resto de Ecuador'!E115)","v":4067},{"$f":"IF('INGRESO DE DATOS'!$W$19=1,'Tablas Guyanas y Santa Elena'!F115,'Tablas Resto de Ecuador'!F115)","v":3754},{"$f":"IF('INGRESO DE DATOS'!$W$19=1,'Tablas Guyanas y Santa Elena'!G115,'Tablas Resto de Ecuador'!G115)","v":2151},{"$f":"IF('INGRESO DE DATOS'!$W$19=1,'Tablas Guyanas y Santa Elena'!H115,'Tablas Resto de Ecuador'!H115)","v":1831},{"$f":"IF('INGRESO DE DATOS'!$W$19=1,'Tablas Guyanas y Santa Elena'!I115,'Tablas Resto de Ecuador'!I115)","v":1281},null,6030,5343,4067,3754,2151,1831,1281]
[53,null,6353,5521,4281,3967,2264,1955,1395,null,{"$f":"IF('INGRESO DE DATOS'!$W$19=1,'Tablas Guyanas y Santa Elena'!C116,'Tablas Resto de Ecuador'!C116)","v":6353},{"$f":"IF('INGRESO DE DATOS'!$W$19=1,'Tablas Guyanas y Santa Elena'!D116,'Tablas Resto de Ecuador'!D116)","v":5521},{"$f":"IF('INGRESO DE DATOS'!$W$19=1,'Tablas Guyanas y Santa Elena'!E116,'Tablas Resto de Ecuador'!E116)","v":4281},{"$f":"IF('INGRESO DE DATOS'!$W$19=1,'Tablas Guyanas y Santa Elena'!F116,'Tablas Resto de Ecuador'!F116)","v":3967},{"$f":"IF('INGRESO DE DATOS'!$W$19=1,'Tablas Guyanas y Santa Elena'!G116,'Tablas Resto de Ecuador'!G116)","v":2264},{"$f":"IF('INGRESO DE DATOS'!$W$19=1,'Tablas Guyanas y Santa Elena'!H116,'Tablas Resto de Ecuador'!H116)","v":1955},{"$f":"IF('INGRESO DE DATOS'!$W$19=1,'Tablas Guyanas y Santa Elena'!I116,'Tablas Resto de Ecuador'!I116)","v":1395},null,6353,5521,4281,3967,2264,1955,1395]
[54,null,6636,5752,4529,4149,2374,2026,1516,null,{"$f":"IF('INGRESO DE DATOS'!$W$19=1,'Tablas Guyanas y Santa Elena'!C117,'Tablas Resto de Ecuador'!C117)","v":6636},{"$f":"IF('INGRESO DE DATOS'!$W$19=1,'Tablas Guyanas y Santa Elena'!D117,'Tablas Resto de Ecuador'!D117)","v":5752},{"$f":"IF('INGRESO DE DATOS'!$W$19=1,'Tablas Guyanas y Santa Elena'!E117,'Tablas Resto de Ecuador'!E117)","v":4529},{"$f":"IF('INGRESO DE DATOS'!$W$19=1,'Tablas Guyanas y Santa Elena'!F117,'Tablas Resto de Ecuador'!F117)","v":4149},{"$f":"IF('INGRESO DE DATOS'!$W$19=1,'Tablas Guyanas y Santa Elena'!G117,'Tablas Resto de Ecuador'!G117)","v":2374},{"$f":"IF('INGRESO DE DATOS'!$W$19=1,'Tablas Guyanas y Santa Elena'!H117,'Tablas Resto de Ecuador'!H117)","v":2026},{"$f":"IF('INGRESO DE DATOS'!$W$19=1,'Tablas Guyanas y Santa Elena'!I117,'Tablas Resto de Ecuador'!I117)","v":1516},null,6636,5752,4529,4149,2374,2026,1516]
[55,null,6903,6020,4806,4323,2483,2100,1645,null,{"$f":"IF('INGRESO DE DATOS'!$W$19=1,'Tablas Guyanas y Santa Elena'!C118,'Tablas Resto de Ecuador'!C118)","v":6903},{"$f":"IF('INGRESO DE DATOS'!$W$19=1,'Tablas Guyanas y Santa Elena'!D118,'Tablas Resto de Ecuador'!D118)","v":6020},{"$f":"IF('INGRESO DE DATOS'!$W$19=1,'Tablas Guyanas y Santa Elena'!E118,'Tablas Resto de Ecuador'!E118)","v":4806},{"$f":"IF('INGRESO DE DATOS'!$W$19=1,'Tablas Guyanas y Santa Elena'!F118,'Tablas Resto de Ecuador'!F118)","v":4323},{"$f":"IF('INGRESO DE DATOS'!$W$19=1,'Tablas Guyanas y Santa Elena'!G118,'Tablas Resto de Ecuador'!G118)","v":2483},{"$f":"IF('INGRESO DE DATOS'!$W$19=1,'Tablas Guyanas y Santa Elena'!H118,'Tablas Resto de Ecuador'!H118)","v":2100},{"$f":"IF('INGRESO DE DATOS'!$W$19=1,'Tablas Guyanas y Santa Elena'!I118,'Tablas Resto de Ecuador'!I118)","v":1645},null,6903,6020,4806,4323,2483,2100,1645]
[56,null,7179,6322,5106,4503,2607,2186,1784,null,{"$f":"IF('INGRESO DE DATOS'!$W$19=1,'Tablas Guyanas y Santa Elena'!C119,'Tablas Resto de Ecuador'!C119)","v":7179},{"$f":"IF('INGRESO DE DATOS'!$W$19=1,'Tablas Guyanas y Santa Elena'!D119,'Tablas Resto de Ecuador'!D119)","v":6322},{"$f":"IF('INGRESO DE DATOS'!$W$19=1,'Tablas Guyanas y Santa Elena'!E119,'Tablas Resto de Ecuador'!E119)","v":5106},{"$f":"IF('INGRESO DE DATOS'!$W$19=1,'Tablas Guyanas y Santa Elena'!F119,'Tablas Resto de Ecuador'!F119)","v":4503},{"$f":"IF('INGRESO DE DATOS'!$W$19=1,'Tablas Guyanas y Santa Elena'!G119,'Tablas Resto de Ecuador'!G119)","v":2607},{"$f":"IF('INGRESO DE DATOS'!$W$19=1,'Tablas Guyanas y Santa Elena'!H119,'Tablas Resto de Ecuador'!H119)","v":2186},{"$f":"IF('INGRESO DE DATOS'!$W$19=1,'Tablas Guyanas y Santa Elena'!I119,'Tablas Resto de Ecuador'!I119)","v":1784},null,7179,6322,5106,4503,2607,2186,1784]
[57,null,7489,6582,5425,4701,2760,2291,1935,null,{"$f":"IF('INGRESO DE DATOS'!$W$19=1,'Tablas Guyanas y Santa Elena'!C120,'Tablas Resto de Ecuador'!C120)","v":7489},{"$f":"IF('INGRESO DE DATOS'!$W$19=1,'Tablas Guyanas y Santa Elena'!D120,'Tablas Resto de Ecuador'!D120)","v":6582},{"$f":"IF('INGRESO DE DATOS'!$W$19=1,'Tablas Guyanas y Santa Elena'!E120,'Tablas Resto de Ecuador'!E120)","v":5425},{"$f":"IF('INGRESO DE DATOS'!$W$19=1,'Tablas Guyanas y Santa Elena'!F120,'Tablas Resto de Ecuador'!F120)","v":4701},{"$f":"IF('INGRESO DE DATOS'!$W$19=1,'Tablas Guyanas y Santa Elena'!G120,'Tablas Resto de Ecuador'!G120)","v":2760},{"$f":"IF('INGRESO DE DATOS'!$W$19=1,'Tablas Guyanas y Santa Elena'!H120,'Tablas Resto de Ecuador'!H120)","v":2291},{"$f":"IF('INGRESO DE DATOS'!$W$19=1,'Tablas Guyanas y Santa Elena'!I120,'Tablas Resto de Ecuador'!I120)","v":1935},null,7489,6582,5425,4701,2760,2291,1935]
[58,null,7830,6807,5757,4928,2959,2426,2096,null,{"$f":"IF('INGRESO DE DATOS'!$W$19=1,'Tablas Guyanas y Santa Elena'!C121,'Tablas Resto de Ecuador'!C121)","v":7830},{"$f":"IF('INGRESO DE DATOS'!$W$19=1,'Tablas Guyanas y Santa Elena'!D121,'Tablas Resto de Ecuador'!D121)","v":6807},{"$f":"IF('INGRESO DE DATOS'!$W$19=1,'Tablas Guyanas y Santa Elena'!E121,'Tablas Resto de Ecuador'!E121)","v":5757},{"$f":"IF('INGRESO DE DATOS'!$W$19=1,'Tablas Guyanas y Santa Elena'!F121,'Tablas Resto de Ecuador'!F121)","v":4928},{"$f":"IF('INGRESO DE DATOS'!$W$19=1,'Tablas Guyanas y Santa Elena'!G121,'Tablas Resto de Ecuador'!G121)","v":2959},{"$f":"IF('INGRESO DE DATOS'!$W$19=1,'Tablas Guyanas y Santa Elena'!H121,'Tablas Resto de Ecuador'!H121)","v":2426},{"$f":"IF('INGRESO DE DATOS'!$W$19=1,'Tablas Guyanas y Santa Elena'!I121,'Tablas Resto de Ecuador'!I121)","v":2096},null,7830,6807,5757,4928,2959,2426,2096]
[59,null,8091,7035,6066,5151,3204,2588,2267,null,{"$f":"IF('INGRESO DE DATOS'!$W$19=1,'Tablas Guyanas y Santa Elena'!C122,'Tablas Resto de Ecuador'!C122)","v":8091},{"$f":"IF('INGRESO DE DATOS'!$W$19=1,'Tablas Guyanas y Santa Elena'!D122,'Tablas Resto de Ecuador'!D122)","v":7035},{"$f":"IF('INGRESO DE DATOS'!$W$19=1,'Tablas Guyanas y Santa Elena'!E122,'Tablas Resto de Ecuador'!E122)","v":6066},{"$f":"IF('INGRESO DE DATOS'!$W$19=1,'Tablas Guyanas y Santa Elena'!F122,'Tablas Resto de Ecuador'!F122)","v":5151},{"$f":"IF('INGRESO DE DATOS'!$W$19=1,'Tablas Guyanas y Santa Elena'!G122,'Tablas Resto de Ecuador'!G122)","v":3204},{"$f":"IF('INGRESO DE DATOS'!$W$19=1,'Tablas Guyanas y Santa Elena'!H122,'Tablas Resto de Ecuador'!H122)","v":2588},{"$f":"IF('INGRESO DE DATOS'!$W$19=1,'Tablas Guyanas y Santa Elena'!I122,'Tablas Resto de Ecuador'!I122)","v":2267},null,8091,7035,6066,5151,3204,2588,2267]
[60,null,8351,7261,6356,5362,3485,2771,2336,null,{"$f":"IF('INGRESO DE DATOS'!$W$19=1,'Tablas Guyanas y Santa Elena'!C123,'Tablas Resto de Ecuador'!C123)","v":8351},{"$f":"IF('INGRESO DE DATOS'!$W$19=1,'Tablas Guyanas y Santa Elena'!D123,'Tablas Resto de Ecuador'!D123)","v":7261},{"$f":"IF('INGRESO DE DATOS'!$W$19=1,'Tablas Guyanas y Santa Elena'!E123,'Tablas Resto de Ecuador'!E123)","v":6356},{"$f":"IF('INGRESO DE DATOS'!$W$19=1,'Tablas Guyanas y Santa Elena'!F123,'Tablas Resto de Ecuador'!F123)","v":5362},{"$f":"IF('INGRESO DE DATOS'!$W$19=1,'Tablas Guyanas y Santa Elena'!G123,'Tablas Resto de Ecuador'!G123)","v":3485},{"$f":"IF('INGRESO DE DATOS'!$W$19=1,'Tablas Guyanas y Santa Elena'!H123,'Tablas Resto de Ecuador'!H123)","v":2771},{"$f":"IF('INGRESO DE DATOS'!$W$19=1,'Tablas Guyanas y Santa Elena'!I123,'Tablas Resto de Ecuador'!I123)","v":2336},null,8351,7261,6356,5362,3485,2771,2336]
[61,null,8673,7539,6681,5611,3801,2978,2366,null,{"$f":"IF('INGRESO DE DATOS'!$W$19=1,'Tablas Guyanas y Santa Elena'!C124,'Tablas Resto de Ecuador'!C124)","v":8673},{"$f":"IF('INGRESO DE DATOS'!$W$19=1,'Tablas Guyanas y Santa Elena'!D124,'Tablas Resto de Ecuador'!D124)","v":7539},{"$f":"IF('INGRESO DE DATOS'!$W$19=1,'Tablas Guyanas y Santa Elena'!E124,'Tablas Resto de Ecuador'!E124)","v":6681},{"$f":"IF('INGRESO DE DATOS'!$W$19=1,'Tablas Guyanas y Santa Elena'!F124,'Tablas Resto de Ecuador'!F124)","v":5611},{"$f":"IF('INGRESO DE DATOS'!$W$19=1,'Tablas Guyanas y Santa Elena'!G124,'Tablas Resto de Ecuador'!G124)","v":3801},{"$f":"IF('INGRESO DE DATOS'!$W$19=1,'Tablas Guyanas y Santa Elena'!H124,'Tablas Resto de Ecuador'!H124)","v":2978},{"$f":"IF('INGRESO DE DATOS'!$W$19=1,'Tablas Guyanas y Santa Elena'!I124,'Tablas Resto de Ecuador'!I124)","v":2366},null,8673,7539,6681,5611,3801,2978,2366]
[62,null,9061,7878,7094,5949,4151,3213,2446,null,{"$f":"IF('INGRESO DE DATOS'!$W$19=1,'Tablas Guyanas y Santa Elena'!C125,'Tablas Resto de Ecuador'!C125)","v":9061},{"$f":"IF('INGRESO DE DATOS'!$W$19=1,'Tablas Guyanas y Santa Elena'!D125,'Tablas Resto de Ecuador'!D125)","v":7878},{"$f":"IF('INGRESO DE DATOS'!$W$19=1,'Tablas Guyanas y Santa Elena'!E125,'Tablas Resto de Ecuador'!E125)","v":7094},{"$f":"IF('INGRESO DE DATOS'!$W$19=1,'Tablas Guyanas y Santa Elena'!F125,'Tablas Resto de Ecuador'!F125)","v":5949},{"$f":"IF('INGRESO DE DATOS'!$W$19=1,'Tablas Guyanas y Santa Elena'!G125,'Tablas Resto de Ecuador'!G125)","v":4151},{"$f":"IF('INGRESO DE DATOS'!$W$19=1,'Tablas Guyanas y Santa Elena'!H125,'Tablas Resto de Ecuador'!H125)","v":3213},{"$f":"IF('INGRESO DE DATOS'!$W$19=1,'Tablas Guyanas y Santa Elena'!I125,'Tablas Resto de Ecuador'!I125)","v":2446},null,9061,7878,7094,5949,4151,3213,2446]
[63,null,9528,8283,7558,6426,4531,3477,2618,null,{"$f":"IF('INGRESO DE DATOS'!$W$19=1,'Tablas Guyanas y Santa Elena'!C126,'Tablas Resto de Ecuador'!C126)","v":9528},{"$f":"IF('INGRESO DE DATOS'!$W$19=1,'Tablas Guyanas y Santa Elena'!D126,'Tablas Resto de Ecuador'!D126)","v":8283},{"$f":"IF('INGRESO DE DATOS'!$W$19=1,'Tablas Guyanas y Santa Elena'!E126,'Tablas Resto de Ecuador'!E126)","v":7558},{"$f":"IF('INGRESO DE DATOS'!$W$19=1,'Tablas Guyanas y Santa Elena'!F126,'Tablas Resto de Ecuador'!F126)","v":6426},{"$f":"IF('INGRESO DE DATOS'!$W$19=1,'Tablas Guyanas y Santa Elena'!G126,'Tablas Resto de Ecuador'!G126)","v":4531},{"$f":"IF('INGRESO DE DATOS'!$W$19=1,'Tablas Guyanas y Santa Elena'!H126,'Tablas Resto de Ecuador'!H126)","v":3477},{"$f":"IF('INGRESO DE DATOS'!$W$19=1,'Tablas Guyanas y Santa Elena'!I126,'Tablas Resto de Ecuador'!I126)","v":2618},null,9528,8283,7558,6426,4531,3477,2618]
[64,null,10077,8764,7988,7045,4905,3757,2917,null,{"$f":"IF('INGRESO DE DATOS'!$W$19=1,'Tablas Guyanas y Santa Elena'!C127,'Tablas Resto de Ecuador'!C127)","v":10077},{"$f":"IF('INGRESO DE DATOS'!$W$19=1,'Tablas Guyanas y Santa Elena'!D127,'Tablas Resto de Ecuador'!D127)","v":8764},{"$f":"IF('INGRESO DE DATOS'!$W$19=1,'Tablas Guyanas y Santa Elena'!E127,'Tablas Resto de Ecuador'!E127)","v":7988},{"$f":"IF('INGRESO DE DATOS'!$W$19=1,'Tablas Guyanas y Santa Elena'!F127,'Tablas Resto de Ecuador'!F127)","v":7045},{"$f":"IF('INGRESO DE DATOS'!$W$19=1,'Tablas Guyanas y Santa Elena'!G127,'Tablas Resto de Ecuador'!G127)","v":4905},{"$f":"IF('INGRESO DE DATOS'!$W$19=1,'Tablas Guyanas y Santa Elena'!H127,'Tablas Resto de Ecuador'!H127)","v":3757},{"$f":"IF('INGRESO DE DATOS'!$W$19=1,'Tablas Guyanas y Santa Elena'!I127,'Tablas Resto de Ecuador'!I127)","v":2917},null,10077,8764,7988,7045,4905,3757,2917]
[65,null,10737,9333,8510,7771,5274,4049,3315,null,{"$f":"IF('INGRESO DE DATOS'!$W$19=1,'Tablas Guyanas y Santa Elena'!C128,'Tablas Resto de Ecuador'!C128)","v":10737},{"$f":"IF('INGRESO DE DATOS'!$W$19=1,'Tablas Guyanas y Santa Elena'!D128,'Tablas Resto de Ecuador'!D128)","v":9333},{"$f":"IF('INGRESO DE DATOS'!$W$19=1,'Tablas Guyanas y Santa Elena'!E128,'Tablas Resto de Ecuador'!E128)","v":8510},{"$f":"IF('INGRESO DE DATOS'!$W$19=1,'Tablas Guyanas y Santa Elena'!F128,'Tablas Resto de Ecuador'!F128)","v":7771},{"$f":"IF('INGRESO DE DATOS'!$W$19=1,'Tablas Guyanas y Santa Elena'!G128,'Tablas Resto de Ecuador'!G128)","v":5274},{"$f":"IF('INGRESO DE DATOS'!$W$19=1,'Tablas Guyanas y Santa Elena'!H128,'Tablas Resto de Ecuador'!H128)","v":4049},{"$f":"IF('INGRESO DE DATOS'!$W$19=1,'Tablas Guyanas y Santa Elena'!I128,'Tablas Resto de Ecuador'!I128)","v":3315},null,10737,9333,8510,7771,5274,4049,3315]
[66,null,11506,10007,9126,8393,5694,4376,3760,null,{"$f":"IF('INGRESO DE DATOS'!$W$19=1,'Tablas Guyanas y Santa Elena'!C129,'Tablas Resto de Ecuador'!C129)","v":11506},{"$f":"IF('INGRESO DE DATOS'!$W$19=1,'Tablas Guyanas y Santa Elena'!D129,'Tablas Resto de Ecuador'!D129)","v":10007},{"$f":"IF('INGRESO DE DATOS'!$W$19=1,'Tablas Guyanas y Santa Elena'!E129,'Tablas Resto de Ecuador'!E129)","v":9126},{"$f":"IF('INGRESO DE DATOS'!$W$19=1,'Tablas Guyanas y Santa Elena'!F129,'Tablas Resto de Ecuador'!F129)","v":8393},{"$f":"IF('INGRESO DE DATOS'!$W$19=1,'Tablas Guyanas y Santa Elena'!G129,'Tablas Resto de Ecuador'!G129)","v":5694},{"$f":"IF('INGRESO DE DATOS'!$W$19=1,'Tablas Guyanas y Santa Elena'!H129,'Tablas Resto de Ecuador'!H129)","v":4376},{"$f":"IF('INGRESO DE DATOS'!$W$19=1,'Tablas Guyanas y Santa Elena'!I129,'Tablas Resto de Ecuador'!I129)","v":3760},null,11506,10007,9126,8393,5694,4376,3760]
[67,null,12425,10807,9855,9069,6223,4763,4195,null,{"$f":"IF('INGRESO DE DATOS'!$W$19=1,'Tablas Guyanas y Santa Elena'!C130,'Tablas Resto de Ecuador'!C130)","v":12425},{"$f":"IF('INGRESO DE DATOS'!$W$19=1,'Tablas Guyanas y Santa Elena'!D130,'Tablas Resto de Ecuador'!D130)","v":10807},{"$f":"IF('INGRESO DE DATOS'!$W$19=1,'Tablas Guyanas y Santa Elena'!E130,'Tablas Resto de Ecuador'!E130)","v":9855},{"$f":"IF('INGRESO DE DATOS'!$W$19=1,'Tablas Guyanas y Santa Elena'!F130,'Tablas Resto de Ecuador'!F130)","v":9069},{"$f":"IF('INGRESO DE DATOS'!$W$19=1,'Tablas Guyanas y Santa Elena'!G130,'Tablas Resto de Ecuador'!G130)","v":6223},{"$f":"IF('INGRESO DE DATOS'!$W$19=1,'Tablas Guyanas y Santa Elena'!H130,'Tablas Resto de Ecuador'!H130)","v":4763},{"$f":"IF('INGRESO DE DATOS'!$W$19=1,'Tablas Guyanas y Santa Elena'!I130,'Tablas Resto de Ecuador'!I130)","v":4195},null,12425,10807,9855,9069,6223,4763,4195]
[68,null,13484,11721,10692,9833,6919,5231,4558,null,{"$f":"IF('INGRESO DE DATOS'!$W$19=1,'Tablas Guyanas y Santa Elena'!C131,'Tablas Resto de Ecuador'!C131)","v":13484},{"$f":"IF('INGRESO DE DATOS'!$W$19=1,'Tablas Guyanas y Santa Elena'!D131,'Tablas Resto de Ecuador'!D131)","v":11721},{"$f":"IF('INGRESO DE DATOS'!$W$19=1,'Tablas Guyanas y Santa Elena'!E131,'Tablas Resto de Ecuador'!E131)","v":10692},{"$f":"IF('INGRESO DE DATOS'!$W$19=1,'Tablas Guyanas y Santa Elena'!F131,'Tablas Resto de Ecuador'!F131)","v":9833},{"$f":"IF('INGRESO DE DATOS'!$W$19=1,'Tablas Guyanas y Santa Elena'!G131,'Tablas Resto de Ecuador'!G131)","v":6919},{"$f":"IF('INGRESO DE DATOS'!$W$19=1,'Tablas Guyanas y Santa Elena'!H131,'Tablas Resto de Ecuador'!H131)","v":5231},{"$f":"IF('INGRESO DE DATOS'!$W$19=1,'Tablas Guyanas y Santa Elena'!I131,'Tablas Resto de Ecuador'!I131)","v":4558},null,13484,11721,10692,9833,6919,5231,4558]
[69,null,14713,12795,11666,10738,7376,5750,4819,null,{"$f":"IF('INGRESO DE DATOS'!$W$19=1,'Tablas Guyanas y Santa Elena'!C132,'Tablas Resto de Ecuador'!C132)","v":14713},{"$f":"IF('INGRESO DE DATOS'!$W$19=1,'Tablas Guyanas y Santa Elena'!D132,'Tablas Resto de Ecuador'!D132)","v":12795},{"$f":"IF('INGRESO DE DATOS'!$W$19=1,'Tablas Guyanas y Santa Elena'!E132,'Tablas Resto de Ecuador'!E132)","v":11666},{"$f":"IF('INGRESO DE DATOS'!$W$19=1,'Tablas Guyanas y Santa Elena'!F132,'Tablas Resto de Ecuador'!F132)","v":10738},{"$f":"IF('INGRESO DE DATOS'!$W$19=1,'Tablas Guyanas y Santa Elena'!G132,'Tablas Resto de Ecuador'!G132)","v":7376},{"$f":"IF('INGRESO DE DATOS'!$W$19=1,'Tablas Guyanas y Santa Elena'!H132,'Tablas Resto de Ecuador'!H132)","v":5750},{"$f":"IF('INGRESO DE DATOS'!$W$19=1,'Tablas Guyanas y Santa Elena'!I132,'Tablas Resto de Ecuador'!I132)","v":4819},null,14713,12795,11666,10738,7376,5750,4819]
[70,null,16137,14033,12683,11950,8155,6304,4983,null,{"$f":"IF('INGRESO DE DATOS'!$W$19=1,'Tablas Guyanas y Santa Elena'!C133,'Tablas Resto de Ecuador'!C133)","v":16137},{"$f":"IF('INGRESO DE DATOS'!$W$19=1,'Tablas Guyanas y Santa Elena'!D133,'Tablas Resto de Ecuador'!D133)","v":14033},{"$f":"IF('INGRESO DE DATOS'!$W$19=1,'Tablas Guyanas y Santa Elena'!E133,'Tablas Resto de Ecuador'!E133)","v":12683},{"$f":"IF('INGRESO DE DATOS'!$W$19=1,'Tablas Guyanas y Santa Elena'!F133,'Tablas Resto de Ecuador'!F133)","v":11950},{"$f":"IF('INGRESO DE DATOS'!$W$19=1,'Tablas Guyanas y Santa Elena'!G133,'Tablas Resto de Ecuador'!G133)","v":8155},{"$f":"IF('INGRESO DE DATOS'!$W$19=1,'Tablas Guyanas y Santa Elena'!H133,'Tablas Resto de Ecuador'!H133)","v":6304},{"$f":"IF('INGRESO DE DATOS'!$W$19=1,'Tablas Guyanas y Santa Elena'!I133,'Tablas Resto de Ecuador'!I133)","v":4983},null,16137,14033,12683,11950,8155,6304,4983]
[71,null,17773,15456,14090,13159,8984,6940,5150,null,{"$f":"IF('INGRESO DE DATOS'!$W$19=1,'Tablas Guyanas y Santa Elena'!C134,'Tablas Resto de Ecuador'!C134)","v":17773},{"$f":"IF('INGRESO DE DATOS'!$W$19=1,'Tablas Guyanas y Santa Elena'!D134,'Tablas Resto de Ecuador'!D134)","v":15456},{"$f":"IF('INGRESO DE DATOS'!$W$19=1,'Tablas Guyanas y Santa Elena'!E134,'Tablas Resto de Ecuador'!E134)","v":14090},{"$f":"IF('INGRESO DE DATOS'!$W$19=1,'Tablas Guyanas y Santa Elena'!F134,'Tablas Resto de Ecuador'!F134)","v":13159},{"$f":"IF('INGRESO DE DATOS'!$W$19=1,'Tablas Guyanas y Santa Elena'!G134,'Tablas Resto de Ecuador'!G134)","v":8984},{"$f":"IF('INGRESO DE DATOS'!$W$19=1,'Tablas Guyanas y Santa Elena'!H134,'Tablas Resto de Ecuador'!H134)","v":6940},{"$f":"IF('INGRESO DE DATOS'!$W$19=1,'Tablas Guyanas y Santa Elena'!I134,'Tablas Resto de Ecuador'!I134)","v":5150},null,17773,15456,14090,13159,8984,6940,5150]
[72,null,19660,17095,15590,14563,9943,7705,5411,null,{"$f":"IF('INGRESO DE DATOS'!$W$19=1,'Tablas Guyanas y Santa Elena'!C135,'Tablas Resto de Ecuador'!C135)","v":19660},{"$f":"IF('INGRESO DE DATOS'!$W$19=1,'Tablas Guyanas y Santa Elena'!D135,'Tablas Resto de Ecuador'!D135)","v":17095},{"$f":"IF('INGRESO DE DATOS'!$W$19=1,'Tablas Guyanas y Santa Elena'!E135,'Tablas Resto de Ecuador'!E135)","v":15590},{"$f":"IF('INGRESO DE DATOS'!$W$19=1,'Tablas Guyanas y Santa Elena'!F135,'Tablas Resto de Ecuador'!F135)","v":14563},{"$f":"IF('INGRESO DE DATOS'!$W$19=1,'Tablas Guyanas y Santa Elena'!G135,'Tablas Resto de Ecuador'!G135)","v":9943},{"$f":"IF('INGRESO DE DATOS'!$W$19=1,'Tablas Guyanas y Santa Elena'!H135,'Tablas Resto de Ecuador'!H135)","v":7705},{"$f":"IF('INGRESO DE DATOS'!$W$19=1,'Tablas Guyanas y Santa Elena'!I135,'Tablas Resto de Ecuador'!I135)","v":5411},null,19660,17095,15590,14563,9943,7705,5411]
[73,null,21837,18987,17309,16167,11034,8644,5857,null,{"$f":"IF('INGRESO DE DATOS'!$W$19=1,'Tablas Guyanas y Santa Elena'!C136,'Tablas Resto de Ecuador'!C136)","v":21837},{"$f":"IF('INGRESO DE DATOS'!$W$19=1,'Tablas Guyanas y Santa Elena'!D136,'Tablas Resto de Ecuador'!D136)","v":18987},{"$f":"IF('INGRESO DE DATOS'!$W$19=1,'Tablas Guyanas y Santa Elena'!E136,'Tablas Resto de Ecuador'!E136)","v":17309},{"$f":"IF('INGRESO DE DATOS'!$W$19=1,'Tablas Guyanas y Santa Elena'!F136,'Tablas Resto de Ecuador'!F136)","v":16167},{"$f":"IF('INGRESO DE DATOS'!$W$19=1,'Tablas Guyanas y Santa Elena'!G136,'Tablas Resto de Ecuador'!G136)","v":11034},{"$f":"IF('INGRESO DE DATOS'!$W$19=1,'Tablas Guyanas y Santa Elena'!H136,'Tablas Resto de Ecuador'!H136)","v":8644},{"$f":"IF('INGRESO DE DATOS'!$W$19=1,'Tablas Guyanas y Santa Elena'!I136,'Tablas Resto de Ecuador'!I136)","v":5857},null,21837,18987,17309,16167,11034,8644,5857]
[74,null,23698,21166,19299,18028,12307,9799,6536,null,{"$f":"IF('INGRESO DE DATOS'!$W$19=1,'Tablas Guyanas y Santa Elena'!C137,'Tablas Resto de Ecuador'!C137)","v":23698},{"$f":"IF('INGRESO DE DATOS'!$W$19=1,'Tablas Guyanas y Santa Elena'!D137,'Tablas Resto de Ecuador'!D137)","v":21166},{"$f":"IF('INGRESO DE DATOS'!$W$19=1,'Tablas Guyanas y Santa Elena'!E137,'Tablas Resto de Ecuador'!E137)","v":19299},{"$f":"IF('INGRESO DE DATOS'!$W$19=1,'Tablas Guyanas y Santa Elena'!F137,'Tablas Resto de Ecuador'!F137)","v":18028},{"$f":"IF('INGRESO DE DATOS'!$W$19=1,'Tablas Guyanas y Santa Elena'!G137,'Tablas Resto de Ecuador'!G137)","v":12307},{"$f":"IF('INGRESO DE DATOS'!$W$19=1,'Tablas Guyanas y Santa Elena'!H137,'Tablas Resto de Ecuador'!H137)","v":9799},{"$f":"IF('INGRESO DE DATOS'!$W$19=1,'Tablas Guyanas y Santa Elena'!I137,'Tablas Resto de Ecuador'!I137)","v":6536},null,23698,21166,19299,18028,12307,9799,6536]
[75,null,25695,23670,21494,20285,13809,10537,7389,null,{"$f":"IF('INGRESO DE DATOS'!$W$19=1,'Tablas Guyanas y Santa Elena'!C138,'Tablas Resto de Ecuador'!C138)","v":25695},{"$f":"IF('INGRESO DE DATOS'!$W$19=1,'Tablas Guyanas y Santa Elena'!D138,'Tablas Resto de Ecuador'!D138)","v":23670},{"$f":"IF('INGRESO DE DATOS'!$W$19=1,'Tablas Guyanas y Santa Elena'!E138,'Tablas Resto de Ecuador'!E138)","v":21494},{"$f":"IF('INGRESO DE DATOS'!$W$19=1,'Tablas Guyanas y Santa Elena'!F138,'Tablas Resto de Ecuador'!F138)","v":20285},{"$f":"IF('INGRESO DE DATOS'!$W$19=1,'Tablas Guyanas y Santa Elena'!G138,'Tablas Resto de Ecuador'!G138)","v":13809},{"$f":"IF('INGRESO DE DATOS'!$W$19=1,'Tablas Guyanas y Santa Elena'!H138,'Tablas Resto de Ecuador'!H138)","v":10537},{"$f":"IF('INGRESO DE DATOS'!$W$19=1,'Tablas Guyanas y Santa Elena'!I138,'Tablas Resto de Ecuador'!I138)","v":7389},null,25695,23670,21494,20285,13809,10537,7389]
[76,null,27822,26543,24183,22744,15483,11316,8186,null,{"$f":"IF('INGRESO DE DATOS'!$W$19=1,'Tablas Guyanas y Santa Elena'!C139,'Tablas Resto de Ecuador'!C139)","v":27822},{"$f":"IF('INGRESO DE DATOS'!$W$19=1,'Tablas Guyanas y Santa Elena'!D139,'Tablas Resto de Ecuador'!D139)","v":26543},{"$f":"IF('INGRESO DE DATOS'!$W$19=1,'Tablas Guyanas y Santa Elena'!E139,'Tablas Resto de Ecuador'!E139)","v":24183},{"$f":"IF('INGRESO DE DATOS'!$W$19=1,'Tablas Guyanas y Santa Elena'!F139,'Tablas Resto de Ecuador'!F139)","v":22744},{"$f":"IF('INGRESO DE DATOS'!$W$19=1,'Tablas Guyanas y Santa Elena'!G139,'Tablas Resto de Ecuador'!G139)","v":15483},{"$f":"IF('INGRESO DE DATOS'!$W$19=1,'Tablas Guyanas y Santa Elena'!H139,'Tablas Resto de Ecuador'!H139)","v":11316},{"$f":"IF('INGRESO DE DATOS'!$W$19=1,'Tablas Guyanas y Santa Elena'!I139,'Tablas Resto de Ecuador'!I139)","v":8186},null,27822,26543,24183,22744,15483,11316,8186]
[77,null,29982,29646,27180,25261,17392,12132,8745,null,{"$f":"IF('INGRESO DE DATOS'!$W$19=1,'Tablas Guyanas y Santa Elena'!C140,'Tablas Resto de Ecuador'!C140)","v":29982},{"$f":"IF('INGRESO DE DATOS'!$W$19=1,'Tablas Guyanas y Santa Elena'!D140,'Tablas Resto de Ecuador'!D140)","v":29646},{"$f":"IF('INGRESO DE DATOS'!$W$19=1,'Tablas Guyanas y Santa Elena'!E140,'Tablas Resto de Ecuador'!E140)","v":27180},{"$f":"IF('INGRESO DE DATOS'!$W$19=1,'Tablas Guyanas y Santa Elena'!F140,'Tablas Resto de Ecuador'!F140)","v":25261},{"$f":"IF('INGRESO DE DATOS'!$W$19=1,'Tablas Guyanas y Santa Elena'!G140,'Tablas Resto de Ecuador'!G140)","v":17392},{"$f":"IF('INGRESO DE DATOS'!$W$19=1,'Tablas Guyanas y Santa Elena'!H140,'Tablas Resto de Ecuador'!H140)","v":12132},{"$f":"IF('INGRESO DE DATOS'!$W$19=1,'Tablas Guyanas y Santa Elena'!I140,'Tablas Resto de Ecuador'!I140)","v":8745},null,29982,29646,27180,25261,17392,12132,8745]
[78,null,32076,31834,29422,27200,18729,12979,9313,null,{"$f":"IF('INGRESO DE DATOS'!$W$19=1,'Tablas Guyanas y Santa Elena'!C141,'Tablas Resto de Ecuador'!C141)","v":32076},{"$f":"IF('INGRESO DE DATOS'!$W$19=1,'Tablas Guyanas y Santa Elena'!D141,'Tablas Resto de Ecuador'!D141)","v":31834},{"$f":"IF('INGRESO DE DATOS'!$W$19=1,'Tablas Guyanas y Santa Elena'!E141,'Tablas Resto de Ecuador'!E141)","v":29422},{"$f":"IF('INGRESO DE DATOS'!$W$19=1,'Tablas Guyanas y Santa Elena'!F141,'Tablas Resto de Ecuador'!F141)","v":27200},{"$f":"IF('INGRESO DE DATOS'!$W$19=1,'Tablas Guyanas y Santa Elena'!G141,'Tablas Resto de Ecuador'!G141)","v":18729},{"$f":"IF('INGRESO DE DATOS'!$W$19=1,'Tablas Guyanas y Santa Elena'!H141,'Tablas Resto de Ecuador'!H141)","v":12979},{"$f":"IF('INGRESO DE DATOS'!$W$19=1,'Tablas Guyanas y Santa Elena'!I141,'Tablas Resto de Ecuador'!I141)","v":9313},null,32076,31834,29422,27200,18729,12979,9313]
[79,null,34106,33965,31516,29136,20046,13849,9877,null,{"$f":"IF('INGRESO DE DATOS'!$W$19=1,'Tablas Guyanas y Santa Elena'!C142,'Tablas Resto de Ecuador'!C142)","v":34106},{"$f":"IF('INGRESO DE DATOS'!$W$19=1,'Tablas Guyanas y Santa Elena'!D142,'Tablas Resto de Ecuador'!D142)","v":33965},{"$f":"IF('INGRESO DE DATOS'!$W$19=1,'Tablas Guyanas y Santa Elena'!E142,'Tablas Resto de Ecuador'!E142)","v":31516},{"$f":"IF('INGRESO DE DATOS'!$W$19=1,'Tablas Guyanas y Santa Elena'!F142,'Tablas Resto de Ecuador'!F142)","v":29136},{"$f":"IF('INGRESO DE DATOS'!$W$19=1,'Tablas Guyanas y Santa Elena'!G142,'Tablas Resto de Ecuador'!G142)","v":20046},{"$f":"IF('INGRESO DE DATOS'!$W$19=1,'Tablas Guyanas y Santa Elena'!H142,'Tablas Resto de Ecuador'!H142)","v":13849},{"$f":"IF('INGRESO DE DATOS'!$W$19=1,'Tablas Guyanas y Santa Elena'!I142,'Tablas Resto de Ecuador'!I142)","v":9877},null,34106,33965,31516,29136,20046,13849,9877]
[80,null,36136,36097,33611,31156,21405,14729,10423,null,{"$f":"IF('INGRESO DE DATOS'!$W$19=1,'Tablas Guyanas y Santa Elena'!C143,'Tablas Resto de Ecuador'!C143)","v":36136},{"$f":"IF('INGRESO DE DATOS'!$W$19=1,'Tablas Guyanas y Santa Elena'!D143,'Tablas Resto de Ecuador'!D143)","v":36097},{"$f":"IF('INGRESO DE DATOS'!$W$19=1,'Tablas Guyanas y Santa Elena'!E143,'Tablas Resto de Ecuador'!E143)","v":33611},{"$f":"IF('INGRESO DE DATOS'!$W$19=1,'Tablas Guyanas y Santa Elena'!F143,'Tablas Resto de Ecuador'!F143)","v":31156},{"$f":"IF('INGRESO DE DATOS'!$W$19=1,'Tablas Guyanas y Santa Elena'!G143,'Tablas Resto de Ecuador'!G143)","v":21405},{"$f":"IF('INGRESO DE DATOS'!$W$19=1,'Tablas Guyanas y Santa Elena'!H143,'Tablas Resto de Ecuador'!H143)","v":14729},{"$f":"IF('INGRESO DE DATOS'!$W$19=1,'Tablas Guyanas y Santa Elena'!I143,'Tablas Resto de Ecuador'!I143)","v":10423},null,36136,36097,33611,31156,21405,14729,10423]
[81,null,36136,36097,33611,31156,21405,14729,10423,null,{"$f":"IF('INGRESO DE DATOS'!$W$19=1,'Tablas Guyanas y Santa Elena'!C144,'Tablas Resto de Ecuador'!C144)","v":36136},{"$f":"IF('INGRESO DE DATOS'!$W$19=1,'Tablas Guyanas y Santa Elena'!D144,'Tablas Resto de Ecuador'!D144)","v":36097},{"$f":"IF('INGRESO DE DATOS'!$W$19=1,'Tablas Guyanas y Santa Elena'!E144,'Tablas Resto de Ecuador'!E144)","v":33611},{"$f":"IF('INGRESO DE DATOS'!$W$19=1,'Tablas Guyanas y Santa Elena'!F144,'Tablas Resto de Ecuador'!F144)","v":31156},{"$f":"IF('INGRESO DE DATOS'!$W$19=1,'Tablas Guyanas y Santa Elena'!G144,'Tablas Resto de Ecuador'!G144)","v":21405},{"$f":"IF('INGRESO DE DATOS'!$W$19=1,'Tablas Guyanas y Santa Elena'!H144,'Tablas Resto de Ecuador'!H144)","v":14729},{"$f":"IF('INGRESO DE DATOS'!$W$19=1,'Tablas Guyanas y Santa Elena'!I144,'Tablas Resto de Ecuador'!I144)","v":10423},null,36136,36097,33611,31156,21405,14729,10423]
[82,null,36136,36097,33611,31156,21405,14729,10423,null,{"$f":"IF('INGRESO DE DATOS'!$W$19=1,'Tablas Guyanas y Santa Elena'!C145,'Tablas Resto de Ecuador'!C145)","v":36136},{"$f":"IF('INGRESO DE DATOS'!$W$19=1,'Tablas Guyanas y Santa Elena'!D145,'Tablas Resto de Ecuador'!D145)","v":36097},{"$f":"IF('INGRESO DE DATOS'!$W$19=1,'Tablas Guyanas y Santa Elena'!E145,'Tablas Resto de Ecuador'!E145)","v":33611},{"$f":"IF('INGRESO DE DATOS'!$W$19=1,'Tablas Guyanas y Santa Elena'!F145,'Tablas Resto de Ecuador'!F145)","v":31156},{"$f":"IF('INGRESO DE DATOS'!$W$19=1,'Tablas Guyanas y Santa Elena'!G145,'Tablas Resto de Ecuador'!G145)","v":21405},{"$f":"IF('INGRESO DE DATOS'!$W$19=1,'Tablas Guyanas y Santa Elena'!H145,'Tablas Resto de Ecuador'!H145)","v":14729},{"$f":"IF('INGRESO DE DATOS'!$W$19=1,'Tablas Guyanas y Santa Elena'!I145,'Tablas Resto de Ecuador'!I145)","v":10423},null,36136,36097,33611,31156,21405,14729,10423]
[83,null,{"$f":"S149*$AD$2","v":36136},{"$f":"T149*$AD$2","v":36097},{"$f":"U149*$AD$2","v":33611},{"$f":"V149*$AD$2","v":31156},{"$f":"W149*$AD$2","v":21405},{"$f":"X149*$AD$2","v":14729},{"$f":"Y149*$AD$2","v":10423},null,{"$f":"IF('INGRESO DE DATOS'!$W$19=1,'Tablas Guyanas y Santa Elena'!C146,'Tablas Resto de Ecuador'!C146)","v":36136},{"$f":"IF('INGRESO DE DATOS'!$W$19=1,'Tablas Guyanas y Santa Elena'!D146,'Tablas Resto de Ecuador'!D146)","v":36097},{"$f":"IF('INGRESO DE DATOS'!$W$19=1,'Tablas Guyanas y Santa Elena'!E146,'Tablas Resto de Ecuador'!E146)","v":33611},{"$f":"IF('INGRESO DE DATOS'!$W$19=1,'Tablas Guyanas y Santa Elena'!F146,'Tablas Resto de Ecuador'!F146)","v":31156},{"$f":"IF('INGRESO DE DATOS'!$W$19=1,'Tablas Guyanas y Santa Elena'!G146,'Tablas Resto de Ecuador'!G146)","v":21405},{"$f":"IF('INGRESO DE DATOS'!$W$19=1,'Tablas Guyanas y Santa Elena'!H146,'Tablas Resto de Ecuador'!H146)","v":14729},{"$f":"IF('INGRESO DE DATOS'!$W$19=1,'Tablas Guyanas y Santa Elena'!I146,'Tablas Resto de Ecuador'!I146)","v":10423},null,{"$f":"K149*$U$4","v":36136},{"$f":"L149*$U$4","v":36097},{"$f":"M149*$U$4","v":33611},{"$f":"N149*$U$4","v":31156},{"$f":"O149*$U$4","v":21405},{"$f":"P149*$U$4","v":14729},{"$f":"Q149*$U$4","v":10423}]
[84,"o más",36136,36097,33611,31156,21405,14729,10423,null,{"$f":"IF('INGRESO DE DATOS'!$W$19=1,'Tablas Guyanas y Santa Elena'!C147,'Tablas Resto de Ecuador'!C147)","v":36136},{"$f":"IF('INGRESO DE DATOS'!$W$19=1,'Tablas Guyanas y Santa Elena'!D147,'Tablas Resto de Ecuador'!D147)","v":36097},{"$f":"IF('INGRESO DE DATOS'!$W$19=1,'Tablas Guyanas y Santa Elena'!E147,'Tablas Resto de Ecuador'!E147)","v":33611},{"$f":"IF('INGRESO DE DATOS'!$W$19=1,'Tablas Guyanas y Santa Elena'!F147,'Tablas Resto de Ecuador'!F147)","v":31156},{"$f":"IF('INGRESO DE DATOS'!$W$19=1,'Tablas Guyanas y Santa Elena'!G147,'Tablas Resto de Ecuador'!G147)","v":21405},{"$f":"IF('INGRESO DE DATOS'!$W$19=1,'Tablas Guyanas y Santa Elena'!H147,'Tablas Resto de Ecuador'!H147)","v":14729},{"$f":"IF('INGRESO DE DATOS'!$W$19=1,'Tablas Guyanas y Santa Elena'!I147,'Tablas Resto de Ecuador'!I147)","v":10423},null,36136,36097,33611,31156,21405,14729,10423]
[1,"Hijo",1003,936,622,565,338,254,153,null,{"$f":"IF('INGRESO DE DATOS'!$W$19=1,'Tablas Guyanas y Santa Elena'!C148,'Tablas Resto de Ecuador'!C148)","v":1003},{"$f":"IF('INGRESO DE DATOS'!$W$19=1,'Tablas Guyanas y Santa Elena'!D148,'Tablas Resto de Ecuador'!D148)","v":936},{"$f":"IF('INGRESO DE DATOS'!$W$19=1,'Tablas Guyanas y Santa Elena'!E148,'Tablas Resto de Ecuador'!E148)","v":622},{"$f":"IF('INGRESO DE DATOS'!$W$19=1,'Tablas Guyanas y Santa Elena'!F148,'Tablas Resto de Ecuador'!F148)","v":565},{"$f":"IF('INGRESO DE DATOS'!$W$19=1,'Tablas Guyanas y Santa Elena'!G148,'Tablas Resto de Ecuador'!G148)","v":338},{"$f":"IF('INGRESO DE DATOS'!$W$19=1,'Tablas Guyanas y Santa Elena'!H148,'Tablas Resto de Ecuador'!H148)","v":254},{"$f":"IF('INGRESO DE DATOS'!$W$19=1,'Tablas Guyanas y Santa Elena'!I148,'Tablas Resto de Ecuador'!I148)","v":153},null,1003,936,622,565,338,254,153]
[2,"Hijos",1812,1688,1138,952,521,387,307,null,{"$f":"IF('INGRESO DE DATOS'!$W$19=1,'Tablas Guyanas y Santa Elena'!C149,'Tablas Resto de Ecuador'!C149)","v":1812},{"$f":"IF('INGRESO DE DATOS'!$W$19=1,'Tablas Guyanas y Santa Elena'!D149,'Tablas Resto de Ecuador'!D149)","v":1688},{"$f":"IF('INGRESO DE DATOS'!$W$19=1,'Tablas Guyanas y Santa Elena'!E149,'Tablas Resto de Ecuador'!E149)","v":1138},{"$f":"IF('INGRESO DE DATOS'!$W$19=1,'Tablas Guyanas y Santa Elena'!F149,'Tablas Resto de Ecuador'!F149)","v":952},{"$f":"IF('INGRESO DE DATOS'!$W$19=1,'Tablas Guyanas y Santa Elena'!G149,'Tablas Resto de Ecuador'!G149)","v":521},{"$f":"IF('INGRESO DE DATOS'!$W$19=1,'Tablas Guyanas y Santa Elena'!H149,'Tablas Resto de Ecuador'!H149)","v":387},{"$f":"IF('INGRESO DE DATOS'!$W$19=1,'Tablas Guyanas y Santa Elena'!I149,'Tablas Resto de Ecuador'!I149)","v":307},null,1812,1688,1138,952,521,387,307]
[3,"Hijos o más",2582,2398,1632,1318,721,580,460,null,{"$f":"IF('INGRESO DE DATOS'!$W$19=1,'Tablas Guyanas y Santa Elena'!C150,'Tablas Resto de Ecuador'!C150)","v":2582},{"$f":"IF('INGRESO DE DATOS'!$W$19=1,'Tablas Guyanas y Santa Elena'!D150,'Tablas Resto de Ecuador'!D150)","v":2398},{"$f":"IF('INGRESO DE DATOS'!$W$19=1,'Tablas Guyanas y Santa Elena'!E150,'Tablas Resto de Ecuador'!E150)","v":1632},{"$f":"IF('INGRESO DE DATOS'!$W$19=1,'Tablas Guyanas y Santa Elena'!F150,'Tablas Resto de Ecuador'!F150)","v":1318},{"$f":"IF('INGRESO DE DATOS'!$W$19=1,'Tablas Guyanas y Santa Elena'!G150,'Tablas Resto de Ecuador'!G150)","v":721},{"$f":"IF('INGRESO DE DATOS'!$W$19=1,'Tablas Guyanas y Santa Elena'!H150,'Tablas Resto de Ecuador'!H150)","v":580},{"$f":"IF('INGRESO DE DATOS'!$W$19=1,'Tablas Guyanas y Santa Elena'!I150,'Tablas Resto de Ecuador'!I150)","v":460},null,2582,2398,1632,1318,721,580,460]
[]
["BUPA ESSENTIAL"]
["TARIFAS ANUALES"]
[]
["EDAD",null,1000,2000,3000,5000,10000,20000,null,null,"TARIFAS BASE",null,null,null,null,null,null,null,"TARIFAS BASE CON DESCUENTO"]
[18,"18-24",{"$f":"S159*$AD$2","v":4501.45},{"$f":"T159*$AD$2","v":4101.1000000000004},{"$f":"U159*$AD$2","v":3886.0499999999997},{"$f":"V159*$AD$2","v":2857.5499999999997},{"$f":"W159*$AD$2","v":2249.7999999999997},{"$f":"X159*$AD$2","v":1723.6499999999999},{"$f":"Y159*$AD$2","v":0},null,{"$f":"IF('INGRESO DE DATOS'!$W$19=1,'Tablas Guyanas y Santa Elena'!C156,'Tablas Resto de Ecuador'!C156)","v":5287},{"$f":"IF('INGRESO DE DATOS'!$W$19=1,'Tablas Guyanas y Santa Elena'!D156,'Tablas Resto de Ecuador'!D156)","v":4816},{"$f":"IF('INGRESO DE DATOS'!$W$19=1,'Tablas Guyanas y Santa Elena'!E156,'Tablas Resto de Ecuador'!E156)","v":4563},{"$f":"IF('INGRESO DE DATOS'!$W$19=1,'Tablas Guyanas y Santa Elena'!F156,'Tablas Resto de Ecuador'!F156)","v":3353},{"$f":"IF('INGRESO DE DATOS'!$W$19=1,'Tablas Guyanas y Santa Elena'!G156,'Tablas Resto de Ecuador'!G156)","v":2638},{"$f":"IF('INGRESO DE DATOS'!$W$19=1,'Tablas Guyanas y Santa Elena'!H156,'Tablas Resto de Ecuador'!H156)","v":2019},{"$f":"IF('INGRESO DE DATOS'!$W$19=1,'Tablas Guyanas y Santa Elena'!I156,'Tablas Resto de Ecuador'!I156)","v":0},null,{"$f":"(K159-50)*$S$4+50","v":4501.45},{"$f":"(L159-50)*$S$4+50","v":4101.1000000000004},3886.0499999999997,2857.5499999999997,2249.7999999999997,1723.6499999999999,{"$f":"Q159*$U$4","v":0}]
[25,"25-29",{"$f":"S160*$AD$2","v":5224.8},4776.8499999999995,4379.05,3172.9,2507.35,1911.5,0,null,{"$f":"IF('INGRESO DE DATOS'!$W$19=1,'Tablas Guyanas y Santa Elena'!C157,'Tablas Resto de Ecuador'!C157)","v":6138},{"$f":"IF('INGRESO DE DATOS'!$W$19=1,'Tablas Guyanas y Santa Elena'!D157,'Tablas Resto de Ecuador'!D157)","v":5611},{"$f":"IF('INGRESO DE DATOS'!$W$19=1,'Tablas Guyanas y Santa Elena'!E157,'Tablas Resto de Ecuador'!E157)","v":5143},{"$f":"IF('INGRESO DE DATOS'!$W$19=1,'Tablas Guyanas y Santa Elena'!F157,'Tablas Resto de Ecuador'!F157)","v":3724},{"$f":"IF('INGRESO DE DATOS'!$W$19=1,'Tablas Guyanas y Santa Elena'!G157,'Tablas Resto de Ecuador'!G157)","v":2941},{"$f":"IF('INGRESO DE DATOS'!$W$19=1,'Tablas Guyanas y Santa Elena'!H157,'Tablas Resto de Ecuador'!H157)","v":2240},{"$f":"IF('INGRESO DE DATOS'!$W$19=1,'Tablas Guyanas y Santa Elena'!I157,'Tablas Resto de Ecuador'!I157)","v":0},null,{"$f":"(K160-50)*$S$4+50","v":5224.8},{"$f":"(L160-50)*$S$4+50","v":4776.8499999999995},{"$f":"(M160-50)*$S$4+50","v":4379.05},{"$f":"(N160-50)*$S$4+50","v":3172.9},{"$f":"(O160-50)*$S$4+50","v":2507.35},{"$f":"(P160-50)*$S$4+50","v":1911.5},{"$f":"Q160*$U$4","v":0}]
[30,"30-34",5932,5438.15,5133.8499999999995,3668.45,2881.35,2197.9499999999998,0,null,{"$f":"IF('INGRESO DE DATOS'!$W$19=1,'Tablas Guyanas y Santa Elena'!C158,'Tablas Resto de Ecuador'!C158)","v":6970},{"$f":"IF('INGRESO DE DATOS'!$W$19=1,'Tablas Guyanas y Santa Elena'!D158,'Tablas Resto de Ecuador'!D158)","v":6389},{"$f":"IF('INGRESO DE DATOS'!$W$19=1,'Tablas Guyanas y Santa Elena'!E158,'Tablas Resto de Ecuador'!E158)","v":6031},{"$f":"IF('INGRESO DE DATOS'!$W$19=1,'Tablas Guyanas y Santa Elena'!F158,'Tablas Resto de Ecuador'!F158)","v":4307},{"$f":"IF('INGRESO DE DATOS'!$W$19=1,'Tablas Guyanas y Santa Elena'!G158,'Tablas Resto de Ecuador'!G158)","v":3381},{"$f":"IF('INGRESO DE DATOS'!$W$19=1,'Tablas Guyanas y Santa Elena'!H158,'Tablas Resto de Ecuador'!H158)","v":2577},{"$f":"IF('INGRESO DE DATOS'!$W$19=1,'Tablas Guyanas y Santa Elena'!I158,'Tablas Resto de Ecuador'!I158)","v":0},null,5932,5438.15,5133.8499999999995,3668.45,2881.35,2197.9499999999998,0]
[35,"35-39",6629,6089.25,5728,4073.9,3195,2431.6999999999998,0,null,{"$f":"IF('INGRESO DE DATOS'!$W$19=1,'Tablas Guyanas y Santa Elena'!C159,'Tablas Resto de Ecuador'!C159)","v":7790},{"$f":"IF('INGRESO DE DATOS'!$W$19=1,'Tablas Guyanas y Santa Elena'!D159,'Tablas Resto de Ecuador'!D159)","v":7155},{"$f":"IF('INGRESO DE DATOS'!$W$19=1,'Tablas Guyanas y Santa Elena'!E159,'Tablas Resto de Ecuador'!E159)","v":6730},{"$f":"IF('INGRESO DE DATOS'!$W$19=1,'Tablas Guyanas y Santa Elena'!F159,'Tablas Resto de Ecuador'!F159)","v":4784},{"$f":"IF('INGRESO DE DATOS'!$W$19=1,'Tablas Guyanas y Santa Elena'!G159,'Tablas Resto de Ecuador'!G159)","v":3750},{"$f":"IF('INGRESO DE DATOS'!$W$19=1,'Tablas Guyanas y Santa Elena'!H159,'Tablas Resto de Ecuador'!H159)","v":2852},{"$f":"IF('INGRESO DE DATOS'!$W$19=1,'Tablas Guyanas y Santa Elena'!I159,'Tablas Resto de Ecuador'!I159)","v":0},null,6629,6089.25,5728,4073.9,3195,2431.6999999999998,0]
[40,"40-44",7323.45,6737.8,6522.75,4592.3999999999996,3608.95,2730.9,0,null,{"$f":"IF('INGRESO DE DATOS'!$W$19=1,'Tablas Guyanas y Santa Elena'!C160,'Tablas Resto de Ecuador'!C160)","v":8607},{"$f":"IF('INGRESO DE DATOS'!$W$19=1,'Tablas Guyanas y Santa Elena'!D160,'Tablas Resto de Ecuador'!D160)","v":7918},{"$f":"IF('INGRESO DE DATOS'!$W$19=1,'Tablas Guyanas y Santa Elena'!E160,'Tablas Resto de Ecuador'!E160)","v":7665},{"$f":"IF('INGRESO DE DATOS'!$W$19=1,'Tablas Guyanas y Santa Elena'!F160,'Tablas Resto de Ecuador'!F160)","v":5394},{"$f":"IF('INGRESO DE DATOS'!$W$19=1,'Tablas Guyanas y Santa Elena'!G160,'Tablas Resto de Ecuador'!G160)","v":4237},{"$f":"IF('INGRESO DE DATOS'!$W$19=1,'Tablas Guyanas y Santa Elena'!H160,'Tablas Resto de Ecuador'!H160)","v":3204},{"$f":"IF('INGRESO DE DATOS'!$W$19=1,'Tablas Guyanas y Santa Elena'!I160,'Tablas Resto de Ecuador'!I160)","v":0},null,7323.45,6737.8,6522.75,4592.3999999999996,3608.95,2730.9,0]
[45,"45-49",8017.9,7387.2,7066.75,5340.4,4179.3,3161,0,null,{"$f":"IF('INGRESO DE DATOS'!$W$19=1,'Tablas Guyanas y Santa Elena'!C161,'Tablas Resto de Ecuador'!C161)","v":9424},{"$f":"IF('INGRESO DE DATOS'!$W$19=1,'Tablas Guyanas y Santa Elena'!D161,'Tablas Resto de Ecuador'!D161)","v":8682},{"$f":"IF('INGRESO DE DATOS'!$W$19=1,'Tablas Guyanas y Santa Elena'!E161,'Tablas Resto de Ecuador'!E161)","v":8305},{"$f":"IF('INGRESO DE DATOS'!$W$19=1,'Tablas Guyanas y Santa Elena'!F161,'Tablas Resto de Ecuador'!F161)","v":6274},{"$f":"IF('INGRESO DE DATOS'!$W$19=1,'Tablas Guyanas y Santa Elena'!G161,'Tablas Resto de Ecuador'!G161)","v":4908},{"$f":"IF('INGRESO DE DATOS'!$W$19=1,'Tablas Guyanas y Santa Elena'!H161,'Tablas Resto de Ecuador'!H161)","v":3710},{"$f":"IF('INGRESO DE DATOS'!$W$19=1,'Tablas Guyanas y Santa Elena'!I161,'Tablas Resto de Ecuador'!I161)","v":0},null,8017.9,7387.2,7066.75,5340.4,4179.3,3161,0]
[50,"50-54",8720.85,8044.25,7577.5999999999995,5733.95,4575.3999999999996,3449.15,0,null,{"$f":"IF('INGRESO DE DATOS'!$W$19=1,'Tablas Guyanas y Santa Elena'!C162,'Tablas Resto de Ecuador'!C162)","v":10251},{"$f":"IF('INGRESO DE DATOS'!$W$19=1,'Tablas Guyanas y Santa Elena'!D162,'Tablas Resto de Ecuador'!D162)","v":9455},{"$f":"IF('INGRESO DE DATOS'!$W$19=1,'Tablas Guyanas y Santa Elena'!E162,'Tablas Resto de Ecuador'!E162)","v":8906},{"$f":"IF('INGRESO DE DATOS'!$W$19=1,'Tablas Guyanas y Santa Elena'!F162,'Tablas Resto de Ecuador'!F162)","v":6737},{"$f":"IF('INGRESO DE DATOS'!$W$19=1,'Tablas Guyanas y Santa Elena'!G162,'Tablas Resto de Ecuador'!G162)","v":5374},{"$f":"IF('INGRESO DE DATOS'!$W$19=1,'Tablas Guyanas y Santa Elena'!H162,'Tablas Resto de Ecuador'!H162)","v":4049},{"$f":"IF('INGRESO DE DATOS'!$W$19=1,'Tablas Guyanas y Santa Elena'!I162,'Tablas Resto de Ecuador'!I162)","v":0},null,8720.85,8044.25,7577.5999999999995,5733.95,4575.3999999999996,3449.15,0]
[55,"55-59",9438.25,8714.9,8107.15,6139.4,5417.75,4067.1,0,null,{"$f":"IF('INGRESO DE DATOS'!$W$19=1,'Tablas Guyanas y Santa Elena'!C163,'Tablas Resto de Ecuador'!C163)","v":11095},{"$f":"IF('INGRESO DE DATOS'!$W$19=1,'Tablas Guyanas y Santa Elena'!D163,'Tablas Resto de Ecuador'!D163)","v":10244},{"$f":"IF('INGRESO DE DATOS'!$W$19=1,'Tablas Guyanas y Santa Elena'!E163,'Tablas Resto de Ecuador'!E163)","v":9529},{"$f":"IF('INGRESO DE DATOS'!$W$19=1,'Tablas Guyanas y Santa Elena'!F163,'Tablas Resto de Ecuador'!F163)","v":7214},{"$f":"IF('INGRESO DE DATOS'!$W$19=1,'Tablas Guyanas y Santa Elena'!G163,'Tablas Resto de Ecuador'!G163)","v":6365},{"$f":"IF('INGRESO DE DATOS'!$W$19=1,'Tablas Guyanas y Santa Elena'!H163,'Tablas Resto de Ecuador'!H163)","v":4776},{"$f":"IF('INGRESO DE DATOS'!$W$19=1,'Tablas Guyanas y Santa Elena'!I163,'Tablas Resto de Ecuador'!I163)","v":0},null,9438.25,8714.9,8107.15,6139.4,5417.75,4067.1,0]
[60,60,10175.199999999999,9403.4,8663.9,6578,5722.05,4299.1499999999996,0,null,{"$f":"IF('INGRESO DE DATOS'!$W$19=1,'Tablas Guyanas y Santa Elena'!C164,'Tablas Resto de Ecuador'!C164)","v":11962},{"$f":"IF('INGRESO DE DATOS'!$W$19=1,'Tablas Guyanas y Santa Elena'!D164,'Tablas Resto de Ecuador'!D164)","v":11054},{"$f":"IF('INGRESO DE DATOS'!$W$19=1,'Tablas Guyanas y Santa Elena'!E164,'Tablas Resto de Ecuador'!E164)","v":10184},{"$f":"IF('INGRESO DE DATOS'!$W$19=1,'Tablas Guyanas y Santa Elena'!F164,'Tablas Resto de Ecuador'!F164)","v":7730},{"$f":"IF('INGRESO DE DATOS'!$W$19=1,'Tablas Guyanas y Santa Elena'!G164,'Tablas Resto de Ecuador'!G164)","v":6723},{"$f":"IF('INGRESO DE DATOS'!$W$19=1,'Tablas Guyanas y Santa Elena'!H164,'Tablas Resto de Ecuador'!H164)","v":5049},{"$f":"IF('INGRESO DE DATOS'!$W$19=1,'Tablas Guyanas y Santa Elena'!I164,'Tablas Resto de Ecuador'!I164)","v":0},null,10175.199999999999,9403.4,8663.9,6578,5722.05,4299.1499999999996,0]
[61,61,10938.5,10116.549999999999,9255.5,7059.0999999999995,6438.5999999999995,4839.75,0,null,{"$f":"IF('INGRESO DE DATOS'!$W$19=1,'Tablas Guyanas y Santa Elena'!C165,'Tablas Resto de Ecuador'!C165)","v":12860},{"$f":"IF('INGRESO DE DATOS'!$W$19=1,'Tablas Guyanas y Santa Elena'!D165,'Tablas Resto de Ecuador'!D165)","v":11893},{"$f":"IF('INGRESO DE DATOS'!$W$19=1,'Tablas Guyanas y Santa Elena'!E165,'Tablas Resto de Ecuador'!E165)","v":10880},{"$f":"IF('INGRESO DE DATOS'!$W$19=1,'Tablas Guyanas y Santa Elena'!F165,'Tablas Resto de Ecuador'!F165)","v":8296},{"$f":"IF('INGRESO DE DATOS'!$W$19=1,'Tablas Guyanas y Santa Elena'!G165,'Tablas Resto de Ecuador'!G165)","v":7566},{"$f":"IF('INGRESO DE DATOS'!$W$19=1,'Tablas Guyanas y Santa Elena'!H165,'Tablas Resto de Ecuador'!H165)","v":5685},{"$f":"IF('INGRESO DE DATOS'!$W$19=1,'Tablas Guyanas y Santa Elena'!I165,'Tablas Resto de Ecuador'!I165)","v":0},null,10938.5,10116.549999999999,9255.5,7059.0999999999995,6438.5999999999995,4839.75,0]
[62,62,11733.25,10859.449999999999,9889.6,7593.75,7150.05,5377.8,0,null,{"$f":"IF('INGRESO DE DATOS'!$W$19=1,'Tablas Guyanas y Santa Elena'!C166,'Tablas Resto de Ecuador'!C166)","v":13795},{"$f":"IF('INGRESO DE DATOS'!$W$19=1,'Tablas Guyanas y Santa Elena'!D166,'Tablas Resto de Ecuador'!D166)","v":12767},{"$f":"IF('INGRESO DE DATOS'!$W$19=1,'Tablas Guyanas y Santa Elena'!E166,'Tablas Resto de Ecuador'!E166)","v":11626},{"$f":"IF('INGRESO DE DATOS'!$W$19=1,'Tablas Guyanas y Santa Elena'!F166,'Tablas Resto de Ecuador'!F166)","v":8925},{"$f":"IF('INGRESO DE DATOS'!$W$19=1,'Tablas Guyanas y Santa Elena'!G166,'Tablas Resto de Ecuador'!G166)","v":8403},{"$f":"IF('INGRESO DE DATOS'!$W$19=1,'Tablas Guyanas y Santa Elena'!H166,'Tablas Resto de Ecuador'!H166)","v":6318},{"$f":"IF('INGRESO DE DATOS'!$W$19=1,'Tablas Guyanas y Santa Elena'!I166,'Tablas Resto de Ecuador'!I166)","v":0},null,11733.25,10859.449999999999,9889.6,7593.75,7150.05,5377.8,0]
[63,63,12566.25,11638.05,10574.699999999999,8190.45,7860.65,5904.8,0,null,{"$f":"IF('INGRESO DE DATOS'!$W$19=1,'Tablas Guyanas y Santa Elena'!C167,'Tablas Resto de Ecuador'!C167)","v":14775},{"$f":"IF('INGRESO DE DATOS'!$W$19=1,'Tablas Guyanas y Santa Elena'!D167,'Tablas Resto de Ecuador'!D167)","v":13683},{"$f":"IF('INGRESO DE DATOS'!$W$19=1,'Tablas Guyanas y Santa Elena'!E167,'Tablas Resto de Ecuador'!E167)","v":12432},{"$f":"IF('INGRESO DE DATOS'!$W$19=1,'Tablas Guyanas y Santa Elena'!F167,'Tablas Resto de Ecuador'!F167)","v":9627},{"$f":"IF('INGRESO DE DATOS'!$W$19=1,'Tablas Guyanas y Santa Elena'!G167,'Tablas Resto de Ecuador'!G167)","v":9239},{"$f":"IF('INGRESO DE DATOS'!$W$19=1,'Tablas Guyanas y Santa Elena'!H167,'Tablas Resto de Ecuador'!H167)","v":6938},{"$f":"IF('INGRESO DE DATOS'!$W$19=1,'Tablas Guyanas y Santa Elena'!I167,'Tablas Resto de Ecuador'!I167)","v":0},null,12566.25,11638.05,10574.699999999999,8190.45,7860.65,5904.8,0]
[64,64,13383.1,12401.35,11281.9,8848.35,8489.65,6438.5999999999995,0,null,{"$f":"IF('INGRESO DE DATOS'!$W$19=1,'Tablas Guyanas y Santa Elena'!C168,'Tablas Resto de Ecuador'!C168)","v":15736},{"$f":"IF('INGRESO DE DATOS'!$W$19=1,'Tablas Guyanas y Santa Elena'!D168,'Tablas Resto de Ecuador'!D168)","v":14581},{"$f":"IF('INGRESO DE DATOS'!$W$19=1,'Tablas Guyanas y Santa Elena'!E168,'Tablas Resto de Ecuador'!E168)","v":13264},{"$f":"IF('INGRESO DE DATOS'!$W$19=1,'Tablas Guyanas y Santa Elena'!F168,'Tablas Resto de Ecuador'!F168)","v":10401},{"$f":"IF('INGRESO DE DATOS'!$W$19=1,'Tablas Guyanas y Santa Elena'!G168,'Tablas Resto de Ecuador'!G168)","v":9979},{"$f":"IF('INGRESO DE DATOS'!$W$19=1,'Tablas Guyanas y Santa Elena'!H168,'Tablas Resto de Ecuador'!H168)","v":7566},{"$f":"IF('INGRESO DE DATOS'!$W$19=1,'Tablas Guyanas y Santa Elena'!I168,'Tablas Resto de Ecuador'!I168)","v":0},null,13383.1,12401.35,11281.9,8848.35,8489.65,6438.5999999999995,0]
[65,65,14186.35,13151.9,12015.449999999999,9572.5499999999993,8623.1,6463.25,0,null,{"$f":"IF('INGRESO DE DATOS'!$W$19=1,'Tablas Guyanas y Santa Elena'!C169,'Tablas Resto de Ecuador'!C169)","v":16681},{"$f":"IF('INGRESO DE DATOS'!$W$19=1,'Tablas Guyanas y Santa Elena'!D169,'Tablas Resto de Ecuador'!D169)","v":15464},{"$f":"IF('INGRESO DE DATOS'!$W$19=1,'Tablas Guyanas y Santa Elena'!E169,'Tablas Resto de Ecuador'!E169)","v":14127},{"$f":"IF('INGRESO DE DATOS'!$W$19=1,'Tablas Guyanas y Santa Elena'!F169,'Tablas Resto de Ecuador'!F169)","v":11253},{"$f":"IF('INGRESO DE DATOS'!$W$19=1,'Tablas Guyanas y Santa Elena'!G169,'Tablas Resto de Ecuador'!G169)","v":10136},{"$f":"IF('INGRESO DE DATOS'!$W$19=1,'Tablas Guyanas y Santa Elena'!H169,'Tablas Resto de Ecuador'!H169)","v":7595},{"$f":"IF('INGRESO DE DATOS'!$W$19=1,'Tablas Guyanas y Santa Elena'!I169,'Tablas Resto de Ecuador'!I169)","v":0},null,14186.35,13151.9,12015.449999999999,9572.5499999999993,8623.1,6463.25,0]
[66,66,15069.5,13977.25,12834,10383.449999999999,8662.1999999999989,6475.15,0,null,{"$f":"IF('INGRESO DE DATOS'!$W$19=1,'Tablas Guyanas y Santa Elena'!C170,'Tablas Resto de Ecuador'!C170)","v":17720},{"$f":"IF('INGRESO DE DATOS'!$W$19=1,'Tablas Guyanas y Santa Elena'!D170,'Tablas Resto de Ecuador'!D170)","v":16435},{"$f":"IF('INGRESO DE DATOS'!$W$19=1,'Tablas Guyanas y Santa Elena'!E170,'Tablas Resto de Ecuador'!E170)","v":15090},{"$f":"IF('INGRESO DE DATOS'!$W$19=1,'Tablas Guyanas y Santa Elena'!F170,'Tablas Resto de Ecuador'!F170)","v":12207},{"$f":"IF('INGRESO DE DATOS'!$W$19=1,'Tablas Guyanas y Santa Elena'!G170,'Tablas Resto de Ecuador'!G170)","v":10182},{"$f":"IF('INGRESO DE DATOS'!$W$19=1,'Tablas Guyanas y Santa Elena'!H170,'Tablas Resto de Ecuador'!H170)","v":7609},{"$f":"IF('INGRESO DE DATOS'!$W$19=1,'Tablas Guyanas y Santa Elena'!I170,'Tablas Resto de Ecuador'!I170)","v":0},null,15069.5,13977.25,12834,10383.449999999999,8662.1999999999989,6475.15,0]
[67,67,16121.8,14960.699999999999,13793.65,11302.3,9529.1999999999989,7195.0999999999995,0,null,{"$f":"IF('INGRESO DE DATOS'!$W$19=1,'Tablas Guyanas y Santa Elena'!C171,'Tablas Resto de Ecuador'!C171)","v":18958},{"$f":"IF('INGRESO DE DATOS'!$W$19=1,'Tablas Guyanas y Santa Elena'!D171,'Tablas Resto de Ecuador'!D171)","v":17592},{"$f":"IF('INGRESO DE DATOS'!$W$19=1,'Tablas Guyanas y Santa Elena'!E171,'Tablas Resto de Ecuador'!E171)","v":16219},{"$f":"IF('INGRESO DE DATOS'!$W$19=1,'Tablas Guyanas y Santa Elena'!F171,'Tablas Resto de Ecuador'!F171)","v":13288},{"$f":"IF('INGRESO DE DATOS'!$W$19=1,'Tablas Guyanas y Santa Elena'!G171,'Tablas Resto de Ecuador'!G171)","v":11202},{"$f":"IF('INGRESO DE DATOS'!$W$19=1,'Tablas Guyanas y Santa Elena'!H171,'Tablas Resto de Ecuador'!H171)","v":8456},{"$f":"IF('INGRESO DE DATOS'!$W$19=1,'Tablas Guyanas y Santa Elena'!I171,'Tablas Resto de Ecuador'!I171)","v":0},null,16121.8,14960.699999999999,13793.65,11302.3,9529.1999999999989,7195.0999999999995,0]
[68,68,17435.899999999998,16188.949999999999,14953.9,12350.35,10241.5,7917.5999999999995,0,null,{"$f":"IF('INGRESO DE DATOS'!$W$19=1,'Tablas Guyanas y Santa Elena'!C172,'Tablas Resto de Ecuador'!C172)","v":20504},{"$f":"IF('INGRESO DE DATOS'!$W$19=1,'Tablas Guyanas y Santa Elena'!D172,'Tablas Resto de Ecuador'!D172)","v":19037},{"$f":"IF('INGRESO DE DATOS'!$W$19=1,'Tablas Guyanas y Santa Elena'!E172,'Tablas Resto de Ecuador'!E172)","v":17584},{"$f":"IF('INGRESO DE DATOS'!$W$19=1,'Tablas Guyanas y Santa Elena'!F172,'Tablas Resto de Ecuador'!F172)","v":14521},{"$f":"IF('INGRESO DE DATOS'!$W$19=1,'Tablas Guyanas y Santa Elena'!G172,'Tablas Resto de Ecuador'!G172)","v":12040},{"$f":"IF('INGRESO DE DATOS'!$W$19=1,'Tablas Guyanas y Santa Elena'!H172,'Tablas Resto de Ecuador'!H172)","v":9306},{"$f":"IF('INGRESO DE DATOS'!$W$19=1,'Tablas Guyanas y Santa Elena'!I172,'Tablas Resto de Ecuador'!I172)","v":0},null,17435.899999999998,16188.949999999999,14953.9,12350.35,10241.5,7917.5999999999995,0]
[69,69,19092.55,17737.649999999998,16378.5,13574.35,11051.55,8280.5499999999993,0,null,{"$f":"IF('INGRESO DE DATOS'!$W$19=1,'Tablas Guyanas y Santa Elena'!C173,'Tablas Resto de Ecuador'!C173)","v":22453},{"$f":"IF('INGRESO DE DATOS'!$W$19=1,'Tablas Guyanas y Santa Elena'!D173,'Tablas Resto de Ecuador'!D173)","v":20859},{"$f":"IF('INGRESO DE DATOS'!$W$19=1,'Tablas Guyanas y Santa Elena'!E173,'Tablas Resto de Ecuador'!E173)","v":19260},{"$f":"IF('INGRESO DE DATOS'!$W$19=1,'Tablas Guyanas y Santa Elena'!F173,'Tablas Resto de Ecuador'!F173)","v":15961},{"$f":"IF('INGRESO DE DATOS'!$W$19=1,'Tablas Guyanas y Santa Elena'!G173,'Tablas Resto de Ecuador'!G173)","v":12993},{"$f":"IF('INGRESO DE DATOS'!$W$19=1,'Tablas Guyanas y Santa Elena'!H173,'Tablas Resto de Ecuador'!H173)","v":9733},{"$f":"IF('INGRESO DE DATOS'!$W$19=1,'Tablas Guyanas y Santa Elena'!I173,'Tablas Resto de Ecuador'!I173)","v":0},null,19092.55,17737.649999999998,16378.5,13574.35,11051.55,8280.5499999999993,0]
[70,70,21029.7,19548.149999999998,18029.2,14323.199999999999,11172.25,8321.35,0,null,{"$f":"IF('INGRESO DE DATOS'!$W$19=1,'Tablas Guyanas y Santa Elena'!C174,'Tablas Resto de Ecuador'!C174)","v":24732},{"$f":"IF('INGRESO DE DATOS'!$W$19=1,'Tablas Guyanas y Santa Elena'!D174,'Tablas Resto de Ecuador'!D174)","v":22989},{"$f":"IF('INGRESO DE DATOS'!$W$19=1,'Tablas Guyanas y Santa Elena'!E174,'Tablas Resto de Ecuador'!E174)","v":21202},{"$f":"IF('INGRESO DE DATOS'!$W$19=1,'Tablas Guyanas y Santa Elena'!F174,'Tablas Resto de Ecuador'!F174)","v":16842},{"$f":"IF('INGRESO DE DATOS'!$W$19=1,'Tablas Guyanas y Santa Elena'!G174,'Tablas Resto de Ecuador'!G174)","v":13135},{"$f":"IF('INGRESO DE DATOS'!$W$19=1,'Tablas Guyanas y Santa Elena'!H174,'Tablas Resto de Ecuador'!H174)","v":9781},{"$f":"IF('INGRESO DE DATOS'!$W$19=1,'Tablas Guyanas y Santa Elena'!I174,'Tablas Resto de Ecuador'!I174)","v":0},null,21029.7,19548.149999999998,18029.2,14323.199999999999,11172.25,8321.35,0]
[71,71,23128.35,21509.1,19809.099999999999,16104.8,12557.75,9354.9499999999989,0,null,{"$f":"IF('INGRESO DE DATOS'!$W$19=1,'Tablas Guyanas y Santa Elena'!C175,'Tablas Resto de Ecuador'!C175)","v":27201},{"$f":"IF('INGRESO DE DATOS'!$W$19=1,'Tablas Guyanas y Santa Elena'!D175,'Tablas Resto de Ecuador'!D175)","v":25296},{"$f":"IF('INGRESO DE DATOS'!$W$19=1,'Tablas Guyanas y Santa Elena'!E175,'Tablas Resto de Ecuador'!E175)","v":23296},{"$f":"IF('INGRESO DE DATOS'!$W$19=1,'Tablas Guyanas y Santa Elena'!F175,'Tablas Resto de Ecuador'!F175)","v":18938},{"$f":"IF('INGRESO DE DATOS'!$W$19=1,'Tablas Guyanas y Santa Elena'!G175,'Tablas Resto de Ecuador'!G175)","v":14765},{"$f":"IF('INGRESO DE DATOS'!$W$19=1,'Tablas Guyanas y Santa Elena'!H175,'Tablas Resto de Ecuador'!H175)","v":10997},{"$f":"IF('INGRESO DE DATOS'!$W$19=1,'Tablas Guyanas y Santa Elena'!I175,'Tablas Resto de Ecuador'!I175)","v":0},null,23128.35,21509.1,19809.099999999999,16104.8,12557.75,9354.9499999999989,0]
[72,72,25267.8,23508.3,21621.3,17891.5,13948.35,10395.35,0,null,{"$f":"IF('INGRESO DE DATOS'!$W$19=1,'Tablas Guyanas y Santa Elena'!C176,'Tablas Resto de Ecuador'!C176)","v":29718},{"$f":"IF('INGRESO DE DATOS'!$W$19=1,'Tablas Guyanas y Santa Elena'!D176,'Tablas Resto de Ecuador'!D176)","v":27648},{"$f":"IF('INGRESO DE DATOS'!$W$19=1,'Tablas Guyanas y Santa Elena'!E176,'Tablas Resto de Ecuador'!E176)","v":25428},{"$f":"IF('INGRESO DE DATOS'!$W$19=1,'Tablas Guyanas y Santa Elena'!F176,'Tablas Resto de Ecuador'!F176)","v":21040},{"$f":"IF('INGRESO DE DATOS'!$W$19=1,'Tablas Guyanas y Santa Elena'!G176,'Tablas Resto de Ecuador'!G176)","v":16401},{"$f":"IF('INGRESO DE DATOS'!$W$19=1,'Tablas Guyanas y Santa Elena'!H176,'Tablas Resto de Ecuador'!H176)","v":12221},{"$f":"IF('INGRESO DE DATOS'!$W$19=1,'Tablas Guyanas y Santa Elena'!I176,'Tablas Resto de Ecuador'!I176)","v":0},null,25267.8,23508.3,21621.3,17891.5,13948.35,10395.35,0]
[73,73,27325.649999999998,25431.85,23369.75,19390.899999999998,15345.75,11427.25,0,null,{"$f":"IF('INGRESO DE DATOS'!$W$19=1,'Tablas Guyanas y Santa Elena'!C177,'Tablas Resto de Ecuador'!C177)","v":32139},{"$f":"IF('INGRESO DE DATOS'!$W$19=1,'Tablas Guyanas y Santa Elena'!D177,'Tablas Resto de Ecuador'!D177)","v":29911},{"$f":"IF('INGRESO DE DATOS'!$W$19=1,'Tablas Guyanas y Santa Elena'!E177,'Tablas Resto de Ecuador'!E177)","v":27485},{"$f":"IF('INGRESO DE DATOS'!$W$19=1,'Tablas Guyanas y Santa Elena'!F177,'Tablas Resto de Ecuador'!F177)","v":22804},{"$f":"IF('INGRESO DE DATOS'!$W$19=1,'Tablas Guyanas y Santa Elena'!G177,'Tablas Resto de Ecuador'!G177)","v":18045},{"$f":"IF('INGRESO DE DATOS'!$W$19=1,'Tablas Guyanas y Santa Elena'!H177,'Tablas Resto de Ecuador'!H177)","v":13435},{"$f":"IF('INGRESO DE DATOS'!$W$19=1,'Tablas Guyanas y Santa Elena'!I177,'Tablas Resto de Ecuador'!I177)","v":0},null,27325.649999999998,25431.85,23369.75,19390.899999999998,15345.75,11427.25,0]
[74,74,29302.75,27279.75,25052.75,20798.5,16736.349999999999,12466.8,0,null,{"$f":"IF('INGRESO DE DATOS'!$W$19=1,'Tablas Guyanas y Santa Elena'!C178,'Tablas Resto de Ecuador'!C178)","v":34465},{"$f":"IF('INGRESO DE DATOS'!$W$19=1,'Tablas Guyanas y Santa Elena'!D178,'Tablas Resto de Ecuador'!D178)","v":32085},{"$f":"IF('INGRESO DE DATOS'!$W$19=1,'Tablas Guyanas y Santa Elena'!E178,'Tablas Resto de Ecuador'!E178)","v":29465},{"$f":"IF('INGRESO DE DATOS'!$W$19=1,'Tablas Guyanas y Santa Elena'!F178,'Tablas Resto de Ecuador'!F178)","v":24460},{"$f":"IF('INGRESO DE DATOS'!$W$19=1,'Tablas Guyanas y Santa Elena'!G178,'Tablas Resto de Ecuador'!G178)","v":19681},{"$f":"IF('INGRESO DE DATOS'!$W$19=1,'Tablas Guyanas y Santa Elena'!H178,'Tablas Resto de Ecuador'!H178)","v":14658},{"$f":"IF('INGRESO DE DATOS'!$W$19=1,'Tablas Guyanas y Santa Elena'!I178,'Tablas Resto de Ecuador'!I178)","v":0},null,29302.75,27279.75,25052.75,20798.5,16736.349999999999,12466.8,0]
[75,75,31280.7,29128.5,26735.75,22206.95,18303.75,13617.699999999999,0,null,{"$f":"IF('INGRESO DE DATOS'!$W$19=1,'Tablas Guyanas y Santa Elena'!C179,'Tablas Resto de Ecuador'!C179)","v":36792},{"$f":"IF('INGRESO DE DATOS'!$W$19=1,'Tablas Guyanas y Santa Elena'!D179,'Tablas Resto de Ecuador'!D179)","v":34260},{"$f":"IF('INGRESO DE DATOS'!$W$19=1,'Tablas Guyanas y Santa Elena'!E179,'Tablas Resto de Ecuador'!E179)","v":31445},{"$f":"IF('INGRESO DE DATOS'!$W$19=1,'Tablas Guyanas y Santa Elena'!F179,'Tablas Resto de Ecuador'!F179)","v":26117},{"$f":"IF('INGRESO DE DATOS'!$W$19=1,'Tablas Guyanas y Santa Elena'!G179,'Tablas Resto de Ecuador'!G179)","v":21525},{"$f":"IF('INGRESO DE DATOS'!$W$19=1,'Tablas Guyanas y Santa Elena'!H179,'Tablas Resto de Ecuador'!H179)","v":16012},{"$f":"IF('INGRESO DE DATOS'!$W$19=1,'Tablas Guyanas y Santa Elena'!I179,'Tablas Resto de Ecuador'!I179)","v":0},null,31280.7,29128.5,26735.75,22206.95,18303.75,13617.699999999999,0]
[1,"Hijo",{"$f":"S183*$AD$2","v":1386.35},{"$f":"T183*$AD$2","v":1295.3999999999999},{"$f":"U183*$AD$2","v":1289.45},{"$f":"V183*$AD$2","v":1127.0999999999999},{"$f":"W183*$AD$2","v":877.19999999999993},{"$f":"X183*$AD$2","v":648.54999999999995},{"$f":"Y183*$AD$2","v":0},null,{"$f":"IF('INGRESO DE DATOS'!$W$19=1,'Tablas Guyanas y Santa Elena'!C180,'Tablas Resto de Ecuador'!C180)","v":1631},{"$f":"IF('INGRESO DE DATOS'!$W$19=1,'Tablas Guyanas y Santa Elena'!D180,'Tablas Resto de Ecuador'!D180)","v":1524},{"$f":"IF('INGRESO DE DATOS'!$W$19=1,'Tablas Guyanas y Santa Elena'!E180,'Tablas Resto de Ecuador'!E180)","v":1517},{"$f":"IF('INGRESO DE DATOS'!$W$19=1,'Tablas Guyanas y Santa Elena'!F180,'Tablas Resto de Ecuador'!F180)","v":1326},{"$f":"IF('INGRESO DE DATOS'!$W$19=1,'Tablas Guyanas y Santa Elena'!G180,'Tablas Resto de Ecuador'!G180)","v":1032},{"$f":"IF('INGRESO DE DATOS'!$W$19=1,'Tablas Guyanas y Santa Elena'!H180,'Tablas Resto de Ecuador'!H180)","v":763},{"$f":"IF('INGRESO DE DATOS'!$W$19=1,'Tablas Guyanas y Santa Elena'!I180,'Tablas Resto de Ecuador'!I223)","v":0},null,{"$f":"K183*$S$4","v":1386.35},{"$f":"L183*$S$4","v":1295.3999999999999},1289.45,1127.0999999999999,877.19999999999993,648.54999999999995,{"$f":"Q183*$U$4","v":0}]
[2,"Hijos",2527.0499999999997,2361.2999999999997,2068.0499999999997,1764.6,1374.45,1075.25,0,null,{"$f":"IF('INGRESO DE DATOS'!$W$19=1,'Tablas Guyanas y Santa Elena'!C181,'Tablas Resto de Ecuador'!C181)","v":2973},{"$f":"IF('INGRESO DE DATOS'!$W$19=1,'Tablas Guyanas y Santa Elena'!D181,'Tablas Resto de Ecuador'!D181)","v":2778},{"$f":"IF('INGRESO DE DATOS'!$W$19=1,'Tablas Guyanas y Santa Elena'!E181,'Tablas Resto de Ecuador'!E181)","v":2433},{"$f":"IF('INGRESO DE DATOS'!$W$19=1,'Tablas Guyanas y Santa Elena'!F181,'Tablas Resto de Ecuador'!F181)","v":2076},{"$f":"IF('INGRESO DE DATOS'!$W$19=1,'Tablas Guyanas y Santa Elena'!G181,'Tablas Resto de Ecuador'!G181)","v":1617},{"$f":"IF('INGRESO DE DATOS'!$W$19=1,'Tablas Guyanas y Santa Elena'!H181,'Tablas Resto de Ecuador'!H181)","v":1265},{"$f":"IF('INGRESO DE DATOS'!$W$19=1,'Tablas Guyanas y Santa Elena'!I181,'Tablas Resto de Ecuador'!I224)","v":0},null,{"$f":"K184*$S$4","v":2527.0499999999997},{"$f":"L184*$S$4","v":2361.2999999999997},{"$f":"M184*$S$4","v":2068.0499999999997},{"$f":"N184*$S$4","v":1764.6},{"$f":"O184*$S$4","v":1374.45},{"$f":"P184*$S$4","v":1075.25},0]
[3,"Hijos o más",3615.9,3378.75,2965.65,2563.6,1995.8,1611.6,0,null,{"$f":"IF('INGRESO DE DATOS'!$W$19=1,'Tablas Guyanas y Santa Elena'!C182,'Tablas Resto de Ecuador'!C182)","v":4254},{"$f":"IF('INGRESO DE DATOS'!$W$19=1,'Tablas Guyanas y Santa Elena'!D182,'Tablas Resto de Ecuador'!D182)","v":3975},{"$f":"IF('INGRESO DE DATOS'!$W$19=1,'Tablas Guyanas y Santa Elena'!E182,'Tablas Resto de Ecuador'!E182)","v":3489},{"$f":"IF('INGRESO DE DATOS'!$W$19=1,'Tablas Guyanas y Santa Elena'!F182,'Tablas Resto de Ecuador'!F182)","v":3016},{"$f":"IF('INGRESO DE DATOS'!$W$19=1,'Tablas Guyanas y Santa Elena'!G182,'Tablas Resto de Ecuador'!G182)","v":2348},{"$f":"IF('INGRESO DE DATOS'!$W$19=1,'Tablas Guyanas y Santa Elena'!H182,'Tablas Resto de Ecuador'!H182)","v":1896},{"$f":"IF('INGRESO DE DATOS'!$W$19=1,'Tablas Guyanas y Santa Elena'!I182,'Tablas Resto de Ecuador'!I225)","v":0},null,3615.9,3378.75,2965.65,2563.6,1995.8,1611.6,0]
[1,"Rider Comp. Maternidad",225,225,225,225,225,225]
[1,"Transplante de organos",300,300,300,300,300,300]

{"sheet":"Tablas Guyanas y Santa Elena","index":6,"n_rows":184,"n_cols":9,"rows_kept":184,"cut":false,"hidden":true,"merged":[[78,0,78,8],[1,0,1,8],[2,0,2,8],[3,0,3,8],[76,0,76,8],[77,0,77,8],[4,0,4,1],[154,0,154,1],[151,0,151,7],[152,0,152,7],[153,0,153,7],[79,0,79,1]]}
[]
["BUPA ESSENTIAL 1000"]
["TARIFAS ANUALES"]
[]
["EDAD",null,250,500,1000,2000,5000,10000,20000]
[18,null,3327,2898,2485,1733,956,558,327]
[19,null,3384,2948,2485,1733,964,564,333]
[20,null,3442,2996,2485,1738,974,574,341]
[21,null,3506,3050,2485,1746,984,585,348]
[22,null,3565,3099,2492,1759,999,594,357]
[23,null,3623,3149,2504,1774,1015,607,368]
[24,null,3682,3200,2524,1796,1032,623,380]
[25,null,3739,3256,2548,1820,1053,638,391]
[26,null,3799,3304,2581,1851,1078,655,404]
[27,null,3857,3353,2620,1887,1104,676,420]
[28,null,3930,3412,2665,1927,1134,698,435]
[29,null,3998,3480,2717,1973,1169,721,452]
[30,null,4068,3540,2780,2023,1203,749,471]
[31,null,4136,3599,2847,2081,1243,778,494]
[32,null,4208,3656,2924,2144,1289,808,516]
[33,null,4322,3761,3009,2212,1337,844,541]
[34,null,4437,3857,3105,2290,1392,880,569]
[35,null,4551,3959,3208,2375,1449,922,598]
[36,null,4665,4058,3324,2467,1512,966,632]
[37,null,4783,4161,3448,2569,1583,1015,666]
[38,null,4901,4265,3585,2678,1657,1067,705]
[39,null,5020,4362,3712,2796,1739,1125,747]
[40,null,5137,4465,3752,2926,1829,1187,792]
[41,null,5251,4569,3791,3067,1924,1254,841]
[42,null,5373,4668,3845,3221,2028,1328,895]
[43,null,5581,4855,3931,3385,2141,1408,954]
[44,null,5797,5042,4051,3565,2264,1493,1017]
[45,null,6010,5224,4195,3757,2395,1586,1086]
[46,null,6222,5410,4358,3903,2538,1688,1162]
[47,null,6439,5597,4535,3776,2693,1797,1242]
[48,null,6667,5795,4723,3764,2862,1916,1331]
[49,null,6890,5993,4920,3896,3043,2044,1428]
[50,null,7114,6188,5132,4126,3146,2084,1539]
[51,null,7339,6257,5356,4412,3182,2259,1677]
[52,null,7564,6191,5591,4710,3227,2446,1824]
[53,null,7832,6267,5838,4977,3296,2548,1984]
[54,null,8102,6513,6096,5205,3373,2755,2156]
[55,null,8373,6878,6364,5424,3449,2978,2340]
[56,null,8627,7318,6645,5644,3547,3095,2536]
[57,null,8901,7745,6938,5876,3689,3294,2749]
[58,null,9210,8007,7245,6133,3896,3403,2978]
[59,null,9519,8278,7501,6374,4168,3527,3122]
[60,null,9825,8542,7726,6590,4492,3659,3237]
[61,null,10205,8871,8058,6843,4866,3819,3380]
[62,null,10849,9315,8442,7194,5289,4026,3573]
[63,null,11603,9988,8892,7704,5562,4300,3836]
[64,null,12409,10713,9399,8357,5882,4629,4193]
[65,null,13279,11493,10013,9111,6298,5000,4632]
[66,null,14212,12336,10736,9873,6782,5431,5114]
[67,null,15216,13240,11594,10671,7328,5941,5602]
[68,null,16292,14213,12577,11570,7943,6547,6059]
[69,null,17449,15261,13722,12634,8677,7222,6425]
[70,null,18986,16511,14923,14059,9596,7955,6726]
[71,null,20908,18183,16577,15482,10570,8785,7050]
[72,null,23129,20111,18341,17134,11698,9754,7484]
[73,null,25690,22337,20365,19022,12983,10903,8115]
[74,null,28641,24902,22706,21210,14479,12250,8999]
[75,null,32022,27847,25287,23865,16246,13201,10078]
[76,null,34933,31226,28450,26758,18215,14214,11269]
[77,null,37773,35071,31975,30053,20463,15894,12487]
[78,null,40529,38378,34820,33056,22991,17066,13649]
[79,null,43199,41077,37404,35503,25833,18287,14616]
[80,null,45870,43777,39988,37949,29230,20293,15546]
[81,null,45870,43777,39988,37949,29230,20293,15546]
[82,null,45870,43777,39988,37949,29230,20293,15546]
[83,null,45870,43777,39988,37949,29230,20293,15546]
[84,"o más",45870,43777,39988,37949,29230,20293,15546]
[1,"Hijo",1022,1059,653,583,415,368,216]
[2,"Hijos",1956,1966,1245,1103,746,435,287]
[3,"Hijos o más",2838,2800,1802,1587,1033,603,431]
[]
["BUPA ESSENTIAL 500"]
["TARIFAS ANUALES"]
[]
["EDAD",null,250,500,1000,2000,5000,10000,20000]
[18,null,2829,2419,1771,1221,666,384,221]
[19,null,2875,2419,1771,1223,673,390,226]
[20,null,2925,2419,1771,1227,680,395,231]
[21,null,2982,2419,1774,1234,689,404,238]
[22,null,3029,2419,1780,1243,698,411,243]
[23,null,3079,2426,1792,1256,710,421,250]
[24,null,3088,2438,1806,1274,723,432,258]
[25,null,3101,2454,1824,1292,738,444,267]
[26,null,3125,2479,1851,1315,757,456,277]
[27,null,3156,2510,1881,1340,775,470,287]
[28,null,3195,2547,1914,1370,798,486,297]
[29,null,3242,2589,1952,1404,822,503,312]
[30,null,3295,2641,1998,1442,850,523,325]
[31,null,3360,2700,2050,1483,878,543,341]
[32,null,3435,2768,2104,1527,912,566,356]
[33,null,3519,2841,2168,1580,945,591,373]
[34,null,3612,2924,2238,1638,984,617,393]
[35,null,3716,3015,2315,1700,1027,647,414]
[36,null,3831,3116,2400,1765,1073,680,437]
[37,null,3959,3228,2490,1839,1123,714,462]
[38,null,4094,3346,2589,1920,1177,751,490]
[39,null,4245,3477,2700,2006,1235,792,517]
[40,null,4365,3619,2767,2101,1301,837,551]
[41,null,4464,3773,2797,2200,1368,885,587]
[42,null,4568,3941,2835,2314,1444,937,624]
[43,null,4742,4122,2895,2433,1525,995,666]
[44,null,4907,4284,2978,2562,1614,1057,711]
[45,null,4857,4440,3074,2703,1708,1123,759]
[46,null,4798,4598,3183,2854,1741,1195,812]
[47,null,4782,4756,3304,3015,1761,1273,870]
[48,null,4862,4900,3437,3038,1802,1358,933]
[49,null,5063,5016,3577,3124,1868,1453,1001]
[50,null,5348,5113,3723,3296,1950,1558,1080]
[51,null,5683,5215,3884,3518,2045,1690,1177]
[52,null,6030,5343,4067,3754,2151,1831,1281]
[53,null,6353,5521,4281,3967,2264,1955,1395]
[54,null,6636,5752,4529,4149,2374,2026,1516]
[55,null,6903,6020,4806,4323,2483,2100,1645]
[56,null,7179,6322,5106,4503,2607,2186,1784]
[57,null,7489,6582,5425,4701,2760,2291,1935]
[58,null,7830,6807,5757,4928,2959,2426,2096]
[59,null,8091,7035,6066,5151,3204,2588,2267]
[60,null,8351,7261,6356,5362,3485,2771,2336]
[61,null,8673,7539,6681,5611,3801,2978,2366]
[62,null,9061,7878,7094,5949,4151,3213,2446]
[63,null,9528,8283,7558,6426,4531,3477,2618]
[64,null,10077,8764,7988,7045,4905,3757,2917]
[65,null,10737,9333,8510,7771,5274,4049,3315]
[66,null,11506,10007,9126,8393,5694,4376,3760]
[67,null,12425,10807,9855,9069,6223,4763,4195]
[68,null,13484,11721,10692,9833,6919,5231,4558]
[69,null,14713,12795,11666,10738,7376,5750,4819]
[70,null,16137,14033,12683,11950,8155,6304,4983]
[71,null,17773,15456,14090,13159,8984,6940,5150]
[72,null,19660,17095,15590,14563,9943,7705,5411]
[73,null,21837,18987,17309,16167,11034,8644,5857]
[74,null,23698,21166,19299,18028,12307,9799,6536]
[75,null,25695,23670,21494,20285,13809,10537,7389]
[76,null,27822,26543,24183,22744,15483,11316,8186]
[77,null,29982,29646,27180,25261,17392,12132,8745]
[78,null,32076,31834,29422,27200,18729,12979,9313]
[79,null,34106,33965,31516,29136,20046,13849,9877]
[80,null,36136,36097,33611,31156,21405,14729,10423]
[81,null,36136,36097,33611,31156,21405,14729,10423]
[82,null,36136,36097,33611,31156,21405,14729,10423]
[83,null,36136,36097,33611,31156,21405,14729,10423]
[84,"o más",36136,36097,33611,31156,21405,14729,10423]
[1,"Hijo",1003,936,622,565,338,254,153]
[2,"Hijos",1812,1688,1138,952,521,387,307]
[3,"Hijos o más",2582,2398,1632,1318,721,580,460]
[]
[" BUPA ESSENTIAL "]
[" TARIFAS ANUALES "]
[]
[" EDAD ",null,0,1000,2000,5000,10000,20000]
[18,"18-24",5287,4816,4563,3353,2638,2019]
[19,"25-29",6138,5611,5143,3724,2941,2240]
[20,"30-34",6970,6389,6031,4307,3381,2577]
[21,"35-39",7790,7155,6730,4784,3750,2852]
[22,"40-44",8607,7918,7665,5394,4237,3204]
[23,"45-49",9424,8682,8305,6274,4908,3710]
[24,"50-54",10251,9455,8906,6737,5374,4049]
[25,"55-59",11095,10244,9529,7214,6365,4776]
[26,"60",11962,11054,10184,7730,6723,5049]
[27,"61",12860,11893,10880,8296,7566,5685]
[28,"62",13795,12767,11626,8925,8403,6318]
[29,"63",14775,13683,12432,9627,9239,6938]
[30,"64",15736,14581,13264,10401,9979,7566]
[31,"65",16681,15464,14127,11253,10136,7595]
[32,"66",17720,16435,15090,12207,10182,7609]
[33,"67",18958,17592,16219,13288,11202,8456]
[34,"68",20504,19037,17584,14521,12040,9306]
[35,"69",22453,20859,19260,15961,12993,9733]
[36,"70",24732,22989,21202,16842,13135,9781]
[37,"71",27201,25296,23296,18938,14765,10997]
[38,"72",29718,27648,25428,21040,16401,12221]
[39,"73",32139,29911,27485,22804,18045,13435]
[40,"74",34465,32085,29465,24460,19681,14658]
[41,"75+",36792,34260,31445,26117,21525,16012]
[1,"1 Child",1631,1524,1517,1326,1032,763]
[2,"2 Children",2973,2778,2433,2076,1617,1265]
[3,"3+ Children",4254,3975,3489,3016,2348,1896]
[1,"Rider Comp. Maternidad",225,225,225,225,225,225]
[1,"Transplante de organos",300,300,300,300,300,300]

{"sheet":"Tablas Resto de Ecuador","index":7,"n_rows":184,"n_cols":9,"rows_kept":184,"cut":false,"hidden":true,"merged":[[78,0,78,8],[76,0,76,8],[77,0,77,8],[1,0,1,8],[2,0,2,8],[3,0,3,8],[4,0,4,1],[154,0,154,1],[151,0,151,7],[152,0,152,7],[153,0,153,7],[79,0,79,1]]}
[]
["BUPA ESSENTIAL 1000"]
["TARIFAS ANUALES"]
[]
["EDAD",null,250,500,1000,2000,5000,10000,20000]
[18,null,3063,2666,2287,1595,877,510,299]
[19,null,3113,2713,2287,1595,884,515,304]
[20,null,3166,2756,2287,1598,892,524,310]
[21,null,3226,2806,2287,1606,903,533,318]
[22,null,3280,2852,2291,1617,915,543,327]
[23,null,3334,2897,2304,1632,929,555,335]
[24,null,3388,2945,2322,1653,948,569,346]
[25,null,3441,2996,2345,1675,965,582,357]
[26,null,3495,3040,2375,1703,988,599,369]
[27,null,3549,3086,2409,1735,1012,618,384]
[28,null,3617,3140,2452,1772,1040,638,398]
[29,null,3678,3203,2500,1815,1071,658,414]
[30,null,3741,3258,2558,1861,1104,683,432]
[31,null,3805,3312,2620,1914,1139,710,450]
[32,null,3871,3363,2689,1973,1182,737,471]
[33,null,3976,3459,2769,2038,1226,770,495]
[34,null,4082,3549,2856,2108,1276,805,520]
[35,null,4187,3641,2952,2186,1328,841,546]
[36,null,4292,3735,3056,2270,1387,882,576]
[37,null,4400,3828,3172,2362,1450,926,607]
[38,null,4511,3923,3299,2465,1520,974,644]
[39,null,4619,4013,3436,2574,1595,1028,682]
[40,null,4725,4106,3583,2693,1676,1083,723]
[41,null,4831,4205,3747,2822,1764,1145,768]
[42,null,4943,4294,3845,2963,1859,1212,816]
[43,null,5136,4467,3931,3114,1962,1286,872]
[44,null,5333,4640,4051,3280,2075,1364,928]
[45,null,5528,4807,4195,3457,2196,1447,991]
[46,null,5724,4978,4358,3647,2327,1540,1061]
[47,null,5924,5149,4535,3776,2469,1641,1134]
[48,null,6134,5330,4723,3764,2623,1751,1215]
[49,null,6339,5513,4920,3896,2789,1868,1304]
[50,null,6547,5694,5132,4126,2983,1902,1407]
[51,null,6752,5873,5355,4412,3182,2062,1532]
[52,null,6961,6054,5522,4710,3227,2233,1665]
[53,null,7206,6266,5717,4977,3296,2327,1812]
[54,null,7453,6480,5911,5200,3373,2516,1967]
[55,null,7702,6698,6103,5386,3449,2718,2135]
[56,null,7949,6912,6298,5573,3547,2826,2316]
[57,null,8188,7125,6495,5760,3689,3052,2510]
[58,null,8473,7369,6699,6005,3896,3296,2718]
[59,null,8759,7617,6902,6248,4168,3416,2944]
[60,null,9040,7859,7106,6491,4469,3659,3186]
[61,null,9388,8161,7414,6735,4636,3819,3380]
[62,null,9983,8571,7777,7040,4848,4026,3573]
[63,null,10674,9190,8182,7401,5099,4300,3836]
[64,null,11419,9856,8648,7825,5393,4629,4193]
[65,null,12216,10575,9212,8412,5773,4954,4632]
[66,null,13075,11349,9877,9085,6217,5347,5092]
[67,null,13999,12180,10667,9817,6717,5772,5503]
[68,null,14989,13078,11572,10645,7282,6513,5945]
[69,null,16053,14040,12626,11625,7954,7032,6424]
[70,null,17466,15190,13730,12937,8796,7592,6726]
[71,null,19236,16729,15250,14245,9689,8551,7050]
[72,null,21278,18504,16873,15765,10724,9229,7484]
[73,null,23636,20551,18735,17500,11901,9959,8115]
[74,null,26349,22910,20888,19512,13272,11185,8999]
[75,null,29462,25621,23263,21957,14893,12054,10078]
[76,null,33040,28729,26173,24618,16698,12980,10884]
[77,null,37104,32265,29418,27648,18758,14512,11677]
[78,null,40529,36253,33054,31064,21074,15583,12500]
[79,null,43199,40729,37138,34905,23681,16697,13345]
[80,null,45870,43777,39988,37949,26794,18529,14194]
[81,null,45870,43777,39988,37949,26794,18529,14194]
[82,null,45870,43777,39988,37949,26794,18529,14194]
[83,null,45870,43777,39988,37949,26794,18529,14194]
[84,"o más",45870,43777,39988,37949,26794,18529,14194]
[1,"Hijo",1022,1036,653,583,415,335,197]
[2,"Hijos",1956,1966,1245,1103,684,398,287]
[3,"Hijos o más",2838,2800,1802,1587,949,549,431]
[]
["BUPA ESSENTIAL 500"]
["TARIFAS ANUALES"]
[]
["EDAD",null,250,500,1000,2000,5000,10000,20000]
[18,null,2603,2226,1630,1124,610,352,202]
[19,null,2646,2226,1630,1125,617,356,206]
[20,null,2692,2226,1630,1128,623,360,211]
[21,null,2742,2226,1632,1136,631,369,217]
[22,null,2787,2226,1638,1145,640,375,223]
[23,null,2833,2232,1647,1157,651,385,228]
[24,null,2841,2241,1662,1171,664,393,236]
[25,null,2854,2258,1679,1188,678,405,245]
[26,null,2875,2280,1703,1210,693,417,258]
[27,null,2903,2310,1730,1234,711,431,277]
[28,null,2938,2342,1761,1261,732,445,287]
[29,null,2983,2382,1796,1292,755,461,284]
[30,null,3032,2431,1839,1326,780,477,296]
[31,null,3092,2485,1885,1365,806,496,310]
[32,null,3160,2546,1936,1407,835,516,326]
[33,null,3238,2615,1994,1455,866,540,341]
[34,null,3324,2689,2058,1506,903,563,359]
[35,null,3419,2774,2130,1563,940,591,378]
[36,null,3526,2867,2208,1624,983,620,400]
[37,null,3641,2969,2290,1692,1030,652,421]
[38,null,3768,3079,2382,1765,1079,685,447]
[39,null,3906,3199,2485,1845,1134,723,472]
[40,null,4016,3329,2594,1933,1191,763,502]
[41,null,4105,3471,2711,2026,1254,808,536]
[42,null,4204,3627,2835,2129,1324,857,571]
[43,null,4363,3792,2895,2239,1398,909,607]
[44,null,4531,3942,2978,2358,1479,965,650]
[45,null,4700,4086,3074,2487,1565,1026,693]
[46,null,4798,4231,3183,2626,1662,1092,742]
[47,null,4782,4376,3304,2776,1761,1162,795]
[48,null,4862,4531,3437,2938,1802,1240,852]
[49,null,5063,4684,3577,3114,1868,1326,913]
[50,null,5348,4840,3723,3296,1950,1423,987]
[51,null,5683,4992,3884,3518,2045,1544,1075]
[52,null,5914,5146,4067,3754,2151,1673,1171]
[53,null,6124,5325,4281,3967,2264,1809,1274]
[54,null,6335,5507,4529,4149,2374,1958,1384]
[55,null,6548,5693,4806,4323,2483,2100,1502]
[56,null,6755,5873,5106,4503,2607,2186,1629]
[57,null,6962,6057,5425,4701,2760,2291,1767]
[58,null,7202,6261,5694,4928,2959,2426,1914]
[59,null,7443,6473,5865,5151,3204,2588,2071]
[60,null,7682,6680,6042,5362,3485,2771,2241]
[61,null,7978,6936,6302,5611,3801,2978,2366]
[62,null,8337,7249,6610,5949,4120,3213,2446]
[63,null,8766,7621,6952,6290,4335,3477,2618]
[64,null,9270,8064,7350,6653,4812,3757,2917]
[65,null,9879,8587,7830,7149,5152,4049,3306]
[66,null,10586,9207,8395,7720,5550,4376,3570]
[67,null,11432,9942,9067,8343,5994,4763,3855]
[68,null,12406,10785,9835,9047,6500,5231,4163]
[69,null,13536,11771,10733,9880,6761,5750,4491]
[70,null,14846,12910,11669,10995,7476,6304,4844]
[71,null,16351,14220,12963,12107,8235,6940,5150]
[72,null,18087,15727,14342,13398,9115,7705,5411]
[73,null,20089,17467,15925,14874,10115,8310,5857]
[74,null,22397,19472,17755,16586,11282,8947,6506]
[75,null,25041,21776,19774,18662,12658,9620,6980]
[76,null,27822,24419,22248,20924,14193,10332,7475]
[77,null,29982,27427,25005,23330,15944,11076,7985]
[78,null,32076,30814,28096,25026,17168,11850,8503]
[79,null,34106,33965,31516,26805,18377,12645,9016]
[80,null,36136,36097,33611,28663,19622,13448,9517]
[81,null,36136,36097,33611,28663,19622,13448,9517]
[82,null,36136,36097,33611,28663,19622,13448,9517]
[83,null,36136,36097,33611,28663,19622,13448,9517]
[84,"o más",36136,36097,33611,28663,19622,13448,9517]
[1,"Hijo",1003,936,622,565,338,231,153]
[2,"Hijos",1812,1688,1138,877,477,387,307]
[3,"Hijos o más",2582,2398,1632,1214,662,580,460]
[]
["BUPA ESSENTIAL"]
["TARIFAS ANUALES"]
[]
["EDAD",null,0,1000,2000,5000,10000,20000]
[18,"18-24",4941,4816,4239,3105,2438,1870]
[25,"25-29",5484,5611,4775,3450,2718,2071]
[30,"30-34",6285,6389,5599,3988,3123,2382]
[35,"35-39",6919,7155,6245,4430,3462,2636]
[40,"40-44",7761,7918,7114,4993,3912,2962]
[45,"45-49",8807,8682,8305,5806,4531,3427]
[50,"50-54",9580,9455,8906,6350,4961,3740]
[55,"55-59",10369,10244,9529,7214,5874,4407]
[60,"60",11179,11054,10184,7730,6202,4659]
[61,"61",12018,11893,10880,8296,6979,5245]
[62,"62",12892,12767,11626,8925,7750,5829]
[63,"63",13808,13683,12432,9627,8520,6400]
[64,"64",14706,14581,13264,10401,9293,6979]
[65,"65",15589,15464,14127,11253,9345,7006]
[66,"66",16560,16435,15090,12070,9388,7017]
[67,"67",17717,17592,16219,13288,10436,7801]
[68,"68",19162,19037,17584,14521,11473,8581]
[69,"69",20984,20859,19260,15409,11978,8975]
[70,"70",23090,22989,21202,15573,12108,9020]
[71,"71",25421,25296,23296,17511,13613,10139]
[72,"72",27773,27648,25428,19453,15118,11267]
[73,"73",30036,29911,27485,21397,16631,12386]
[74,"74",32210,32085,29465,23338,18140,13513]
[75,"75+",34385,34260,31445,25524,19839,14760]
[1,"1 Child",1524,1524,1517,1226,952,704]
[2,"2 Children",2778,2778,2253,1920,1491,1265]
[3,"3+ Children",3975,3975,3235,2787,2164,1896]
[1,"Rider Comp. Maternidad",225,225,225,225,225,225]
[1,"Transplante de organos",300,300,300,300,300,300]